{"text_format":"1","workbook":"xlsx","n_sheets":7,"sheets":["Calculator","Standards","Records","SlalomCalc","NatsData13","NatsData12","NatsData11"],"not_rendered":{"charts":0,"images":0,"macros":1,"external_links":0,"defined_names":189,"comments":0,"pivot_tables":0},"unopened":[],"bounds":{"document_bytes":16777216,"sheet_cells":100000,"rows_first":2000,"rows_last":500,"rows_between":2000,"halvings":0,"cell_chars":16384,"cell_head_chars":4096},"cells_cut":0,"cells_raw":0,"read":"whole","date_system":"1900"}

{"sheet":"Calculator","index":0,"n_rows":31,"n_cols":27,"rows_kept":31,"cut":false,"hidden":false,"merged":[[20,7,20,8],[21,7,21,8],[22,7,22,8],[23,7,23,8],[29,7,29,8],[24,7,24,8],[25,7,25,8],[26,7,26,8],[27,7,27,8],[28,7,28,8]]}
[]
[null,null,null,{"$f":"D3","v":"M4"},null,"Buoys","Pts","Ft",null,"S","T","J",null,"Total",null,null,null,"Benchmark",null,"Division",null,"Year "]
[null,null,null,{"$f":"T3","v":"M4"},null,{"$f":"T3","v":"M4"},{"$f":"T3","v":"M4"},{"$f":"T3","v":"M4"},null,{"$f":"S7","v":42},{"$f":"T3","v":"M4"},{"$f":"S9","v":0.2},null,{"$f":"T3","v":"M4"},null,null,null,"Standard2",null,"M4",null,"2013"]
[null,null,null,{"$f":"VLOOKUP(T3,DivisionNames,3,FALSE)","v":"Men 4"}]
[null,null,null,"Standard2",null,{"$f":"VLOOKUP($D$4,DivisionInfo,2,FALSE)","v":102},{"$f":"VLOOKUP($D$4,DivisionInfo,3,FALSE)","v":5500},{"$f":"VLOOKUP($D$4,DivisionInfo,4,FALSE)","v":161},null,{"$f":"(Standards!AF5/Standards!AF$5*multiplier)^exponent","v":1500.0000000000027},{"$f":"(G5/G$5*multiplier)^exponent","v":1500.0000000000027},{"$f":"IF(OR(D$4=\"Boys 1\",D$4=\"Girls 1\"),\"n/a\",(Standards!AG5/Standards!AG$5*multiplier)^Standards!E2)","v":1500.0000000000027},null,null,null,null,null,"Growth rate",null,1.6,null,"Percentages compared to the benchmark"]
[null,{"$f":"IF(N6=\"\",\"\",IF(AND(F6=\"\",G6=\"\",H6=\"\"),\"\",RANK(N6,$N$6:$N$16)))","v":""},null,null,null,null,null,null,null,null,null,null,null,null,null,null,null,null,null,null,null,null,"S","T","J",null,"Total"]
[null,1,null,"Whetsel, Kirby",null,92.5,2310,158,null,{"$f":"IF(F7=\"\",0,(Standards!AF7/Standards!AF$5*multiplier)^exponent)","v":1138.4539373143568},{"$f":"IF(G7=\"\",0,(G7/G$5*multiplier)^exponent)","v":374.36059054351654},{"$f":"IF(OR(D$4=\"Boys 1\",D$4=\"Girls 1\",H7=\"\"),0,(Standards!AG7/Standards!AG$5*multiplier)^Standards!E2)","v":1444.4912118877166},null,{"$f":"IF(AND(F7=\"\",G7=\"\",H7=\"\"),\"\",IF(OR(D$4=\"Boys 1\",D$4=\"Girls 1\"),J7+K7,J7+K7+L7))","v":2957.30573974559},null,null,null,"SOF",{"$f":"VLOOKUP(D4,DivisionInfo,5,0)+T7","v":42},0,null,{"$f":"LEFT(VLOOKUP(1,scored,3,FALSE),FIND(\",\",VLOOKUP(1,scored,3,FALSE))-1)","v":"Whetsel"},{"$f":"(VLOOKUP(1,scored,5,FALSE)-$S$7)/($F$5-$S$7)","v":0.84166666666666667},{"$f":"VLOOKUP(1,scored,6,FALSE)/$G$5","v":0.42},{"$f":"IF(OR(D2=\"G1\",D2=\"B1\"),\"n/a\",(VLOOKUP(1,scored,7,FALSE)-($S$9*$H$5))/(0.85*$H$5))","v":0.91925465838509324},null,{"$f":"IF(OR(D2=\"G1\",D2=\"B1\"),W7+X7,W7+X7+Y7)","v":2.1809213250517598}]
[null,2,null,"Newman, Thomas",null,92,2570,155,null,{"$f":"IF(F8=\"\",0,(Standards!AF8/Standards!AF$5*multiplier)^exponent)","v":1120.4726634714284},444.02145252387214,{"$f":"IF(OR(D$4=\"Boys 1\",D$4=\"Girls 1\",H8=\"\"),0,(Standards!AG8/Standards!AG$5*multiplier)^Standards!E2)","v":1389.7710639405061},null,2954.2651799358064,null,null,null,null,null,null,null,{"$f":"LEFT(VLOOKUP(2,scored,3,FALSE),FIND(\",\",VLOOKUP(2,scored,3,FALSE))-1)","v":"Newman"},{"$f":"(VLOOKUP(2,scored,5,FALSE)-$S$7)/($F$5-$S$7)","v":0.83333333333333337},{"$f":"VLOOKUP(2,scored,6,FALSE)/$G$5","v":0.46727272727272728},{"$f":"IF(OR(D2=\"G1\",D2=\"B1\"),\"n/a\",(VLOOKUP(2,scored,7,FALSE)-($S$9*$H$5))/(0.85*$H$5))","v":0.89733284618195108},null,{"$f":"IF(OR(D2=\"G1\",D2=\"B1\"),W8+X8,W8+X8+Y8)","v":2.197938906788012}]
[null,3,null,"Grau, Mitch",null,87,2220,164,null,{"$f":"IF(F9=\"\",0,(Standards!AF9/Standards!AF$5*multiplier)^exponent)","v":946.64965397023252},351.29803049537793,{"$f":"IF(OR(D$4=\"Boys 1\",D$4=\"Girls 1\",H9=\"\"),0,(Standards!AG9/Standards!AG$5*multiplier)^Standards!E2)","v":1556.2900277539395},null,2854.2377122195503,null,null,null,"JOF",{"$f":"IF(OR(D$4=\"Boys 1\",D$4=\"Girls 1\"),\"n/a\",Standards!J$2+T9)","v":0.2},0,null,{"$f":"LEFT(VLOOKUP(3,scored,3,FALSE),FIND(\",\",VLOOKUP(3,scored,3,FALSE))-1)","v":"Grau"},{"$f":"(VLOOKUP(3,scored,5,FALSE)-$S$7)/($F$5-$S$7)","v":0.75},{"$f":"VLOOKUP(3,scored,6,FALSE)/$G$5","v":0.40363636363636363},{"$f":"IF(OR(D2=\"G1\",D2=\"B1\"),\"n/a\",(VLOOKUP(3,scored,7,FALSE)-($S$9*$H$5))/(0.85*$H$5))","v":0.96309828279137755},null,{"$f":"IF(OR(D2=\"G1\",D2=\"B1\"),W9+X9,W9+X9+Y9)","v":2.1167346464277412}]
[null,4,null,"Haines, Hutch",null,97.5,1010,154,null,{"$f":"IF(F10=\"\",0,(Standards!AF10/Standards!AF$5*multiplier)^exponent)","v":1324.091603104866},99.638034967115132,{"$f":"IF(OR(D$4=\"Boys 1\",D$4=\"Girls 1\",H10=\"\"),0,(Standards!AG10/Standards!AG$5*multiplier)^Standards!E2)","v":1371.7075830183487},null,2795.4372210903298]
[null,5,null,"Snape, R Scott",null,94,1140,141,null,{"$f":"IF(F11=\"\",0,(Standards!AF11/Standards!AF$5*multiplier)^exponent)","v":1193.0389105291338},120.93686824047289,{"$f":"IF(OR(D$4=\"Boys 1\",D$4=\"Girls 1\",H11=\"\"),0,(Standards!AG11/Standards!AG$5*multiplier)^Standards!E2)","v":1145.0701955802831},null,2459.0459743498895,null,null,null,"Overall multiple",null,1500,null,"Separation using new calc",null,null,{"$f":"LEFT(VLOOKUP(1,scored,3,FALSE),FIND(\",\",VLOOKUP(1,scored,3,FALSE))-1) & \" vs \" & LEFT(VLOOKUP(2,scored,3,FALSE),FIND(\",\",VLOOKUP(2,scored,3,FALSE))-1)","v":"Whetsel vs Newman"}]
[null,6,null,"Webb, Greg",null,86,1940,140,null,{"$f":"IF(F12=\"\",0,(Standards!AF12/Standards!AF$5*multiplier)^exponent)","v":913.21606072525788},283.13510779725669,{"$f":"IF(OR(D$4=\"Boys 1\",D$4=\"Girls 1\",H12=\"\"),0,(Standards!AG12/Standards!AG$5*multiplier)^Standards!E2)","v":1128.2774168877945},null,2324.6285854103089,null,null,null,null,null,null,null,null,null,"S","T","J","Overall"]
[null,7,null,"Lindsey, Jeff",null,90.5,2170,127,null,{"$f":"IF(F13=\"\",0,(Standards!AF13/Standards!AF$5*multiplier)^exponent)","v":1067.1759766198609},338.72443733086055,{"$f":"IF(OR(D$4=\"Boys 1\",D$4=\"Girls 1\",H13=\"\"),0,(Standards!AG13/Standards!AG$5*multiplier)^Standards!E2)","v":918.58472210391449},null,2324.4851360546359,null,null,null,null,null,null,null,"Calculated",null,{"$f":"VLOOKUP(1,scored,9,FALSE)-VLOOKUP(2,scored,9,FALSE)","v":17.981273842928431},{"$f":"VLOOKUP(1,scored,10,FALSE)-VLOOKUP(2,scored,10,FALSE)","v":-69.660861980355605},{"$f":"VLOOKUP(1,scored,11,FALSE)-VLOOKUP(2,scored,11,FALSE)","v":54.720147947210535},{"$f":"VLOOKUP(1,B6:N16,13,FALSE)-VLOOKUP(2,B6:N16,13,FALSE)","v":3.0405598097836446}]
[null,8,null,"Estes, Robbie",null,94,1370,123,null,{"$f":"IF(F14=\"\",0,(Standards!AF14/Standards!AF$5*multiplier)^exponent)","v":1193.0389105291338},162.27957562450109,{"$f":"IF(OR(D$4=\"Boys 1\",D$4=\"Girls 1\",H14=\"\"),0,(Standards!AG14/Standards!AG$5*multiplier)^Standards!E2)","v":857.36003582457636},null,2212.6785219782114,null,null,null,null,null,null,null,"Raw score difference",null,{"$f":"VLOOKUP(1,scored,5,FALSE)-VLOOKUP(2,scored,5,FALSE)","v":0.5},{"$f":"VLOOKUP(1,scored,6,FALSE)-VLOOKUP(2,scored,6,FALSE)","v":-260},{"$f":"VLOOKUP(1,scored,7,FALSE)-VLOOKUP(2,scored,7,FALSE)","v":3}]
[null,10,null,"Budzynski, Mark",null,98,1330,102,null,{"$f":"IF(F15=\"\",0,(Standards!AF15/Standards!AF$5*multiplier)^exponent)","v":1343.2291302242224},154.76529555226639,{"$f":"IF(OR(D$4=\"Boys 1\",D$4=\"Girls 1\",H15=\"\"),0,(Standards!AG15/Standards!AG$5*multiplier)^Standards!E2)","v":562.85244167471649},null,2060.8468674512055]
{"$rows_left_out":17}
{"sheet":"Standards","index":1,"n_rows":37,"n_cols":33,"rows_kept":37,"cut":false,"hidden":false,"merged":[[42,8,42,9],[41,8,41,9],[1,12,1,13],[0,12,0,13],[1,31,1,32]]}
[null,null,"Overall multiple",null,{"$f":"Calculator!T11","v":1500},null,"System",null,"SOF","JOF",null,null,"Multiplier",null,null,"Method",null,"Year",null,null,null,null,null,"Rates","sof adj","jof adj"]
[null,null,"Growth rate",null,{"$f":"Calculator!T5","v":1.6},null,1000,null,48,0.2,null,null,{"$f":"10^(LOG(E1)/E2)","v":96.617776104230373},null,null,"Standard1",null,"2011",null,null,null,null,null,1,-48,-0.15,null,null,null,null,null,"adj raw score"]
[null,null,null,null,null,null,1500,null,null,null,null,null,null,null,null,"Standard2",null,"2012",null,null,null,null,null,1.25,-42,-0.1,null,null,null,null,null,{"$f":"VLOOKUP(Calculator!$D$4,Standards!$D$7:$J$39,7,FALSE)","v":0},{"$f":"VLOOKUP(Calculator!$D$4,Standards!$D$7:$J$39,7,FALSE)","v":0}]
[null,null,null,null,null,null,null,null,null,null,null,null,null,null,null,"Records",null,"2013",null,null,null,null,null,1.5,-36,-0.05]
[null,null,null,null,null,null,null,null,null,null,null,null,null,null,null,"TopScore",null,null,null,null,null,null,null,1.6,-30,0,null,null,null,null,null,{"$f":"IF(Calculator!F5<=Calculator!J$3,0,Calculator!F5-Calculator!J$3)","v":60},{"$f":"IF(OR(Calculator!D$4=\"Boys 1\",Calculator!D$4=\"Girls 1\"),\"n/a\",IF(Calculator!H5<=Calculator!H$5*Calculator!L$3,0,Calculator!H5-Calculator!H$5*Calculator!L$3))","v":128.80000000000001}]
[null,"DivisionNames",null,null,"S","T","J","SOF","adj",null,null,"Standard 1",null,null,null,"Records",null,null,null,"TopScore",null,"avg",null,1.75,-24,0.05,null,"Standard 2"]
[null,"B1",null,"Boys 1",73,4000,"n/a",{"$f":"$I$2-I7","v":30},18,null,null,81,4090,"n/a",null,81,4090,"n/a",null,79.67,2333,"n/a",null,2,-18,0.1,null,73,4000,"n/a",null,{"$f":"IF(Calculator!F7<=Calculator!J$3,0,Calculator!F7-Calculator!J$3)","v":50.5},{"$f":"IF(OR(Calculator!D$4=\"Boys 1\",Calculator!D$4=\"Girls 1\"),\"n/a\",IF(Calculator!H7<=Calculator!H$5*Calculator!L$3,0,Calculator!H7-Calculator!H$5*Calculator!L$3))","v":125.8}]
[null,"B2",null,"Boys 2",94,7000,129,{"$f":"$I$2-I8","v":42},6,null,null,104,7870,143,null,104,7870,143,null,100.67,4410,138,null,null,-12,0.15,null,94,7000,129,null,{"$f":"IF(Calculator!F8<=Calculator!J$3,0,Calculator!F8-Calculator!J$3)","v":50},{"$f":"IF(OR(Calculator!D$4=\"Boys 1\",Calculator!D$4=\"Girls 1\"),\"n/a\",IF(Calculator!H8<=Calculator!H$5*Calculator!L$3,0,Calculator!H8-Calculator!H$5*Calculator!L$3))","v":122.8}]
[null,"B3",null,"Boys 3",105,9000,172,48,0,null,null,117,9000,191,null,117,10430,191,null,111.5,6940,186,null,null,-6,0.2,null,105,9000,172,null,{"$f":"IF(Calculator!F9<=Calculator!J$3,0,Calculator!F9-Calculator!J$3)","v":45},{"$f":"IF(OR(Calculator!D$4=\"Boys 1\",Calculator!D$4=\"Girls 1\"),\"n/a\",IF(Calculator!H9<=Calculator!H$5*Calculator!L$3,0,Calculator!H9-Calculator!H$5*Calculator!L$3))","v":131.80000000000001}]
[null,"G1",null,"Girls 1",72,5000,"n/a",30,18,null,null,80,5340,"n/a",null,80,5340,"n/a",null,68.17,3360,"n/a",null,null,0,0.25,null,72,5000,"n/a",null,{"$f":"IF(Calculator!F10<=Calculator!J$3,0,Calculator!F10-Calculator!J$3)","v":55.5},{"$f":"IF(OR(Calculator!D$4=\"Boys 1\",Calculator!D$4=\"Girls 1\"),\"n/a\",IF(Calculator!H10<=Calculator!H$5*Calculator!L$3,0,Calculator!H10-Calculator!H$5*Calculator!L$3))","v":121.8}]
[null,"G2",null,"Girls 2",86,6000,108,36,12,null,null,93,6790,120,null,95,6790,120,null,91.67,7215,104.5,null,null,6,null,null,86,6000,108,null,{"$f":"IF(Calculator!F11<=Calculator!J$3,0,Calculator!F11-Calculator!J$3)","v":52},{"$f":"IF(OR(Calculator!D$4=\"Boys 1\",Calculator!D$4=\"Girls 1\"),\"n/a\",IF(Calculator!H11<=Calculator!H$5*Calculator!L$3,0,Calculator!H11-Calculator!H$5*Calculator!L$3))","v":108.8}]
[null,"G3",null,"Girls 3",90,7000,139,42,6,null,null,100,8000,154,null,100,9230,154,null,101.25,9580,127,null,null,12,null,null,90,7000,139,null,{"$f":"IF(Calculator!F12<=Calculator!J$3,0,Calculator!F12-Calculator!J$3)","v":44},{"$f":"IF(OR(Calculator!D$4=\"Boys 1\",Calculator!D$4=\"Girls 1\"),\"n/a\",IF(Calculator!H12<=Calculator!H$5*Calculator!L$3,0,Calculator!H12-Calculator!H$5*Calculator!L$3))","v":107.8}]
[null,"M1",null,"Men 1",109,9000,188,48,0,null,null,121,8000,209,null,121,11070,209,null,122,9113,203.3,null,null,18,null,null,109,9000,188,null,{"$f":"IF(Calculator!F13<=Calculator!J$3,0,Calculator!F13-Calculator!J$3)","v":48.5},{"$f":"IF(OR(Calculator!D$4=\"Boys 1\",Calculator!D$4=\"Girls 1\"),\"n/a\",IF(Calculator!H13<=Calculator!H$5*Calculator!L$3,0,Calculator!H13-Calculator!H$5*Calculator!L$3))","v":94.8}]
[null,"M2",null,"Men 2",110,9000,194,48,0,null,null,122,8000,216,null,122,12090,216,null,121.5,5653,185,null,null,24,null,null,110,9000,194,null,{"$f":"IF(Calculator!F14<=Calculator!J$3,0,Calculator!F14-Calculator!J$3)","v":52},{"$f":"IF(OR(Calculator!D$4=\"Boys 1\",Calculator!D$4=\"Girls 1\"),\"n/a\",IF(Calculator!H14<=Calculator!H$5*Calculator!L$3,0,Calculator!H14-Calculator!H$5*Calculator!L$3))","v":90.8}]
[null,"M3",null,"Men 3",104,7000,178,42,6,null,null,115.25,7000,198,null,115.25,12070,198,null,111,7270,175.5,null,null,30,null,null,104,7000,178,null,{"$f":"IF(Calculator!F15<=Calculator!J$3,0,Calculator!F15-Calculator!J$3)","v":56},{"$f":"IF(OR(Calculator!D$4=\"Boys 1\",Calculator!D$4=\"Girls 1\"),\"n/a\",IF(Calculator!H15<=Calculator!H$5*Calculator!L$3,0,Calculator!H15-Calculator!H$5*Calculator!L$3))","v":69.8}]
{"$rows_left_out":23}
{"sheet":"Records","index":2,"n_rows":80,"n_cols":19,"rows_kept":80,"cut":false,"hidden":false,"merged":[]}
["Records",null,null,"Jan 4, 2013"]
[]
["B1",null,null,null,null,null,null,null,"G1",null,null,null,null,null,null,"Records condensed"]
["Slalom",null,{"$f":"D4+HLOOKUP(F4,buoyCount,2,0)-6+IF(COUNTIF(SpdOnly,F4)=1,0,HLOOKUP(A3,countAdj,2,0))","v":81},3,"@",12,null,null,"Slalom",null,{"$f":"L4+HLOOKUP(N4,buoyCount,2,0)-6+IF(COUNTIF(SpdOnly,N4)=1,0,HLOOKUP(I3,countAdj,2,0))","v":80},2,"@",12,null,"B1",{"$f":"C4","v":81},{"$f":"C5","v":4090},"n/a"]
["Tricks",null,4090,null,null,null,null,null,"Tricks",null,5340,null,null,null,null,"B2",{"$f":"C8","v":104},{"$f":"C9","v":7870},{"$f":"C10","v":143}]
[null,null,null,null,null,null,null,null,null,null,null,null,null,null,null,"B3",{"$f":"C13","v":117},{"$f":"C14","v":10430},{"$f":"C15","v":191}]
["B2",null,null,null,null,null,null,null,"G2",null,null,null,null,null,null,"G1",{"$f":"K4","v":80},{"$f":"K5","v":5340},"n/a"]
["Slalom",null,{"$f":"D8+HLOOKUP(F8,buoyCount,2,0)-6+IF(COUNTIF(SpdOnly,F8)=1,0,HLOOKUP(A7,countAdj,2,0))","v":104},2,"@",10.75,null,null,"Slalom",null,{"$f":"L8+HLOOKUP(N8,buoyCount,2,0)-6+IF(COUNTIF(SpdOnly,N8)=1,0,HLOOKUP(I7,countAdj,2,0))","v":95},5,"@",11.25,null,"G2",{"$f":"K8","v":95},{"$f":"K9","v":6790},{"$f":"K10","v":120}]
["Tricks",null,7870,null,null,null,null,null,"Tricks",null,6790,null,null,null,null,"G3",{"$f":"K13","v":100},{"$f":"K14","v":9230},{"$f":"K15","v":154}]
["Jump",null,143,null,43.5,null,null,null,"Jump",null,120,null,null,null,null,"M1",{"$f":"C23","v":121},{"$f":"C24","v":11070},{"$f":"C25","v":209}]
[null,null,null,null,null,null,null,null,null,null,null,null,null,null,null,"M2",{"$f":"C28","v":122},{"$f":"C29","v":12090},{"$f":"C30","v":216}]
["B3",null,null,null,null,null,null,null,"G3",null,null,null,null,null,null,"M3",{"$f":"C38","v":115.25},{"$f":"C39","v":12070},{"$f":"C40","v":198}]
["Slalom",null,{"$f":"D13+HLOOKUP(F13,buoyCount,2,0)-6+IF(COUNTIF(SpdOnly,F13)=1,0,HLOOKUP(A12,countAdj,2,0))","v":117},3,"@",10.25,null,null,"Slalom",null,{"$f":"L13+HLOOKUP(N13,buoyCount,2,0)-6+IF(COUNTIF(SpdOnly,N13)=1,0,HLOOKUP(I12,countAdj,2,0))","v":100},4,"@",11.25,null,"M4",{"$f":"C43","v":113},{"$f":"C44","v":10420},{"$f":"C45","v":179}]
["Tricks",null,10430,null,null,null,null,null,"Tricks",null,9230,null,null,null,null,"M5",{"$f":"C48","v":111},{"$f":"C49","v":5490},{"$f":"C50","v":156}]
["Jump",null,191,null,null,null,null,null,"Jump",null,154,null,null,null,null,"M6",{"$f":"C53","v":104.5},{"$f":"C54","v":3940},{"$f":"C55","v":129}]
{"$rows_left_out":66}
{"sheet":"SlalomCalc","index":3,"n_rows":37,"n_cols":31,"rows_kept":37,"cut":false,"hidden":false,"merged":[]}
[]
[null,"Div",null,"Buoys",null,"Spd/Line",null,"Total",null,null,null,"Div",null,"Total",null,"Buoys",null,"Spd/Line"]
[null,"M8",null,4.25,"@",49,null,{"$f":"IF(F3>F5,\"error\",D3+HLOOKUP(F3,buoyCount,2,0)-6+IF(COUNTIF(SpdOnly,F3)=1,0,HLOOKUP(B3,countAdj,2,0)))","v":52.25},null,null,null,"W10",null,89,null,{"$f":"IF(MOD(N3,6)=0,6,MOD(N3,6))","v":5},"@",{"$f":"IF(N3>O5,HLOOKUP(IF(N3>O5,INT(N3/6)+IF(N3>O5,HLOOKUP(L3,countAdj,4,FALSE),0)+IF(P3<6,1,0),0),buoyOffset,2,FALSE) & \"m\",HLOOKUP(INT(N3/6)+IF(P3<6,1,0),buoyOffset,2,FALSE) & \"k\")","v":"10.75m"}]
[]
[null,null,null,"Max Spd",null,{"$f":"HLOOKUP(B3,countAdj,3,FALSE)","v":49},null,null,null,null,null,"Max Spd Count",null,null,{"$f":"HLOOKUP(HLOOKUP(L3,countAdj,3,FALSE),buoyCount,2,FALSE)","v":48}]
[]
["Offset",1,2,3,4,5,6,7,8,9,10,11,12,13,14,15,16,17,18,19,20,21]
["Spd/Line",25,28,31,34,37,40,43,46,49,52,55,58,18.25,16,14.25,13,12,11.25,10.75,10.25,9.75]
["Count",6,12,18,24,30,36,42,48,54,60,66,72,78,84,90,96,102,108,114,120,126]
[]
[]
["B1","B2","B3","G1","G2","G3","M1","M2","M3","M4","M5","M6","M7","M8","M9","M10","M11","W1","W2","W3","W4","W5","W6","W7","W8","W9","W10","W11","MM","OM","OW"]
[-18,-6,0,-18,-12,-6,0,0,-6,-6,-6,-6,-12,-18,-18,-18,-18,-6,-6,-6,-6,-12,-12,-18,-18,-24,-24,-24,-6,0,-6]
[49,55,58,49,52,55,58,58,55,55,55,55,52,49,49,49,49,55,55,55,55,52,52,49,49,46,46,46,55,58,55]
[3,1,0,3,2,1,0,0,1,1,1,1,2,3,3,3,3,1,1,1,1,2,2,3,3,4,4,4,1,0,1]
{"$rows_left_out":23}
{"sheet":"NatsData13","index":4,"n_rows":163,"n_cols":16,"rows_kept":163,"cut":false,"hidden":false,"merged":[]}
["Skier",null,"S","T","J","Div","Slalom result",null,null,null,"Skier",null,"S nops","T nops","J nops","NOPS"]
["Bryans, James",null,72.5,1540,null,"B1",0.5,49,1300,null,"Bryans, James",null,1341.8,908.8,null,2250.6]
["Roberts, Edward",null,63,1580,null,"B1",3,49,1600,null,"Roberts, Edward",null,1165.8,920.8,null,2086.6]
["Weber, Samuel",null,67.5,1240,null,"B1",1.5,49,1425,null,"Weber, Samuel",null,1249.0999999999999,813.2,null,2062.3000000000002]
["Arnold, Zachary",null,63,1060,null,"B1",3,49,1600,null,"Arnold, Zachary",null,1165.8,750.3,null,1916.1]
["Robbins, Evan",null,43.5,1980,null,"B1",1.5,46,2300,null,"Robbins, Evan",null,807.6,1033.9000000000001,null,1841.5]
["Keller, Brody",null,68.5,480,null,"B1",2.5,49,1425,null,"Keller, Brody",null,1267.5999999999999,499.8,null,1767.3999999999999]
["Panneton, Brian",null,68,440,null,"B1",2,49,1425,null,"Panneton, Brian",null,1258.4000000000001,477.9,null,1736.3000000000002]
["Grubbs, Blaze",null,63,280,null,"B1",3,49,1600,null,"Grubbs, Blaze",null,1165.8,379,null,1544.8]
["Hooten, Carter",null,32.5,1610,null,"B1",2.5,40,2300,null,"Hooten, Carter",null,607.9,929.8,null,1537.6999999999998]
["Waltrip, Luke",null,39.5,660,null,"B1",3.5,43,2300,null,"Waltrip, Luke",null,734.7,588.4,null,1323.1]
["Canepa, Ryan",null,103,3630,101,"B2",1,55,1075,null,"Canepa, Ryan",null,1473.2,1019.5,1121,3613.7]
["Haines, Quinn",null,93,3180,129,"B2",3,55,1200,null,"Haines, Quinn",null,1218,954.4,1379.1,3551.5]
["Fry, Colten",null,93,810,121,"B2",3,55,1200,null,"Fry, Colten",null,1218,482.3,1307.7,3008]
["Stallings, Garrett",null,85.5,4310,69,"B2",1.5,55,1300,null,"Stallings, Garrett",null,1041.5,1110.7,787.2,2939.3999999999996]
{"$rows_left_out":149}
{"sheet":"NatsData12","index":5,"n_rows":170,"n_cols":16,"rows_kept":170,"cut":false,"hidden":false,"merged":[]}
["Skier",null,"S","T","J","Div","Slalom result",null,null,null,"Skier",null,"S nops","T nops","J nops","NOPS"]
["Gay ,Ryan",null,62,2380,null,"B1",2,49,1600,null,"Gay ,Ryan",null,1147.4000000000001,1136.2,null,2283.6000000000004]
["Butterfield ,Zachary",null,62,1870,null,"B1",2,49,1600,null,"Butterfield ,Zachary",null,1147.4000000000001,1004,null,2151.4]
["Mccormick ,Noah",null,68,1370,null,"B1",2,49,1425,null,"Mccormick ,Noah",null,1258.4000000000001,855.9,null,2114.3000000000002]
["Roberts ,William",null,68,1270,null,"B1",2,49,1425,null,"Roberts ,William",null,1258.4000000000001,823.2,null,2081.6000000000004]
["Pound ,Trace",null,67,780,null,"B1",1,49,1425,null,"Pound ,Trace",null,1239.8,641.1,null,1880.9]
["Roberts ,Edward",null,58.5,1060,null,"B1",4.5,49,1825,null,"Roberts ,Edward",null,1082.8,750.3,null,1833.1]
["Collins ,Austin",null,50,1130,null,"B1",2,49,2300,null,"Collins ,Austin",null,926.5,775.4,null,1701.9]
["Lindaman ,Gabe",null,67,290,null,"B1",1,49,1425,null,"Lindaman ,Gabe",null,1239.8,385.9,null,1625.6999999999998]
["Stockstill ,Cade",null,62,380,null,"B1",2,49,1600,null,"Stockstill ,Cade",null,1147.4000000000001,443.3,null,1590.7]
["Weber ,Samuel",null,55,480,null,"B1",1,49,1825,null,"Weber ,Samuel",null,1018.3,499.8,null,1518.1]
["Haines, Quinn",null,92,2190,117,"B2",2,55,1200,null,"Haines, Quinn",null,1193.7,792.3,1271.4000000000001,3257.4]
["Canepa, Ryan",null,91.5,3310,95,"B2",1.5,55,1200,null,"Canepa, Ryan",null,1181.5999999999999,973.6,1062.2,3217.3999999999996]
["Montgomery, Ryan",null,90,2210,91,"B2",6,55,1300,null,"Montgomery, Ryan",null,1145.8,795.9,1022.2,2963.8999999999996]
["Goddard, Thomas",null,75.5,2080,109,"B2",3.5,55,1600,null,"Goddard, Thomas",null,826.5,772.2,1197.3,2796]
{"$rows_left_out":156}
{"sheet":"NatsData11","index":6,"n_rows":178,"n_cols":16,"rows_kept":178,"cut":false,"hidden":false,"merged":[]}
["Skier",null,"S","T","J","Div","Slalom result",null,null,null,"Skier",null,"S nops","T nops","J nops","NOPS"]
["Warner, Ryan",null,74,2480,null,"B1",2,49,1300,null,"Warner, Ryan",null,1383.2,1232.3,0,2615.5]
["Butterfield, Zachary",null,56,1350,null,"B1",2,49,1825,null,"Butterfield, Zachary",null,1078.2,970.3,0,2048.5]
["Keller, Blake",null,62.5,570,null,"B1",2.5,49,1600,null,"Keller, Blake",null,1189.2,691.4,0,1880.6]
["Stange, Griffin",null,49.5,820,null,"B1",1.5,49,2300,null,"Stange, Griffin",null,966,797.7,0,1763.7]
["Roberts, Edward",null,46.5,820,null,"B1",4.5,46,2300,null,"Roberts, Edward",null,913.7,797.7,0,1711.4]
["Gay, Ryan",null,40.5,1120,null,"B1",4.5,43,2300,null,"Gay, Ryan",null,808.3,901.6,0,1709.9]
["Collins, Austin",null,48,700,null,"B1",6,46,2300,null,"Collins, Austin",null,939.9,749.6,0,1689.5]
["Mccormick, Noah",null,45,760,null,"B1",3,46,2300,null,"Mccormick, Noah",null,887.5,774.2,0,1661.7]
["Cirilli, Rocco",null,52,290,null,"B1",4,49,2300,null,"Cirilli, Rocco",null,1009.3,530.20000000000005,0,1539.5]
["Roberts, William",null,50,290,null,"B1",2,49,2300,null,"Roberts, William",null,974.6,530.20000000000005,0,1504.8]
["Garcia, Taylor",null,96.5,4280,142,"B2",0.5,55,1125,null,"Garcia, Taylor",null,1310.0999999999999,1156.5,1634.4,4101]
["Lang, Nicholas",null,95.5,5340,127,"B2",5.5,55,1200,null,"Lang, Nicholas",null,1285.7,1271.0999999999999,1450.8,4007.6]
["Guyer, Corbin",null,87,3580,119,"B2",3,55,1300,null,"Guyer, Corbin",null,1086.3,1071.5999999999999,1352,3509.9]
["MacIntyre, Zachary",null,82,4650,84,"B2",4,55,1425,null,"MacIntyre, Zachary",null,976.2,1198.2,910.2,3084.6]
{"$rows_left_out":163}