{"text_format":"1","workbook":"xlsx","n_sheets":7,"sheets":["Calculator","Standards","Records","SlalomCalc","NatsData13","NatsData12","NatsData11"],"not_rendered":{"charts":0,"images":0,"macros":1,"external_links":0,"defined_names":189,"comments":0,"pivot_tables":0},"unopened":[],"bounds":{"document_bytes":16777216,"sheet_cells":100000,"rows_first":2000,"rows_last":500,"rows_between":2000,"halvings":0,"cell_chars":16384,"cell_head_chars":4096},"cells_cut":0,"cells_raw":0,"read":"whole","date_system":"1900"}

{"sheet":"Calculator","index":0,"n_rows":31,"n_cols":27,"rows_kept":31,"cut":false,"hidden":false,"merged":[[20,7,20,8],[21,7,21,8],[22,7,22,8],[23,7,23,8],[29,7,29,8],[24,7,24,8],[25,7,25,8],[26,7,26,8],[27,7,27,8],[28,7,28,8]]}
[]
[null,null,null,{"$f":"D3","v":"M4"},null,"Buoys","Pts","Ft",null,"S","T","J",null,"Total",null,null,null,"Benchmark",null,"Division",null,"Year "]
[null,null,null,{"$f":"T3","v":"M4"},null,{"$f":"T3","v":"M4"},{"$f":"T3","v":"M4"},{"$f":"T3","v":"M4"},null,{"$f":"S7","v":42},{"$f":"T3","v":"M4"},{"$f":"S9","v":0.2},null,{"$f":"T3","v":"M4"},null,null,null,"Standard2",null,"M4",null,"2013"]
[null,null,null,{"$f":"VLOOKUP(T3,DivisionNames,3,FALSE)","v":"Men 4"}]
[null,null,null,"Standard2",null,{"$f":"VLOOKUP($D$4,DivisionInfo,2,FALSE)","v":102},{"$f":"VLOOKUP($D$4,DivisionInfo,3,FALSE)","v":5500},{"$f":"VLOOKUP($D$4,DivisionInfo,4,FALSE)","v":161},null,{"$f":"(Standards!AF5/Standards!AF$5*multiplier)^exponent","v":1500.0000000000027},{"$f":"(G5/G$5*multiplier)^exponent","v":1500.0000000000027},{"$f":"IF(OR(D$4=\"Boys 1\",D$4=\"Girls 1\"),\"n/a\",(Standards!AG5/Standards!AG$5*multiplier)^Standards!E2)","v":1500.0000000000027},null,null,null,null,null,"Growth rate",null,1.6,null,"Percentages compared to the benchmark"]
[null,{"$f":"IF(N6=\"\",\"\",IF(AND(F6=\"\",G6=\"\",H6=\"\"),\"\",RANK(N6,$N$6:$N$16)))","v":""},null,null,null,null,null,null,null,null,null,null,null,null,null,null,null,null,null,null,null,null,"S","T","J",null,"Total"]
[null,1,null,"Whetsel, Kirby",null,92.5,2310,158,null,{"$f":"IF(F7=\"\",0,(Standards!AF7/Standards!AF$5*multiplier)^exponent)","v":1138.4539373143568},{"$f":"IF(G7=\"\",0,(G7/G$5*multiplier)^exponent)","v":374.36059054351654},{"$f":"IF(OR(D$4=\"Boys 1\",D$4=\"Girls 1\",H7=\"\"),0,(Standards!AG7/Standards!AG$5*multiplier)^Standards!E2)","v":1444.4912118877166},null,{"$f":"IF(AND(F7=\"\",G7=\"\",H7=\"\"),\"\",IF(OR(D$4=\"Boys 1\",D$4=\"Girls 1\"),J7+K7,J7+K7+L7))","v":2957.30573974559},null,null,null,"SOF",{"$f":"VLOOKUP(D4,DivisionInfo,5,0)+T7","v":42},0,null,{"$f":"LEFT(VLOOKUP(1,scored,3,FALSE),FIND(\",\",VLOOKUP(1,scored,3,FALSE))-1)","v":"Whetsel"},{"$f":"(VLOOKUP(1,scored,5,FALSE)-$S$7)/($F$5-$S$7)","v":0.84166666666666667},{"$f":"VLOOKUP(1,scored,6,FALSE)/$G$5","v":0.42},{"$f":"IF(OR(D2=\"G1\",D2=\"B1\"),\"n/a\",(VLOOKUP(1,scored,7,FALSE)-($S$9*$H$5))/(0.85*$H$5))","v":0.91925465838509324},null,{"$f":"IF(OR(D2=\"G1\",D2=\"B1\"),W7+X7,W7+X7+Y7)","v":2.1809213250517598}]
[null,2,null,"Newman, Thomas",null,92,2570,155,null,{"$f":"IF(F8=\"\",0,(Standards!AF8/Standards!AF$5*multiplier)^exponent)","v":1120.4726634714284},444.02145252387214,{"$f":"IF(OR(D$4=\"Boys 1\",D$4=\"Girls 1\",H8=\"\"),0,(Standards!AG8/Standards!AG$5*multiplier)^Standards!E2)","v":1389.7710639405061},null,2954.2651799358064,null,null,null,null,null,null,null,{"$f":"LEFT(VLOOKUP(2,scored,3,FALSE),FIND(\",\",VLOOKUP(2,scored,3,FALSE))-1)","v":"Newman"},{"$f":"(VLOOKUP(2,scored,5,FALSE)-$S$7)/($F$5-$S$7)","v":0.83333333333333337},{"$f":"VLOOKUP(2,scored,6,FALSE)/$G$5","v":0.46727272727272728},{"$f":"IF(OR(D2=\"G1\",D2=\"B1\"),\"n/a\",(VLOOKUP(2,scored,7,FALSE)-($S$9*$H$5))/(0.85*$H$5))","v":0.89733284618195108},null,{"$f":"IF(OR(D2=\"G1\",D2=\"B1\"),W8+X8,W8+X8+Y8)","v":2.197938906788012}]
[null,3,null,"Grau, Mitch",null,87,2220,164,null,{"$f":"IF(F9=\"\",0,(Standards!AF9/Standards!AF$5*multiplier)^exponent)","v":946.64965397023252},351.29803049537793,{"$f":"IF(OR(D$4=\"Boys 1\",D$4=\"Girls 1\",H9=\"\"),0,(Standards!AG9/Standards!AG$5*multiplier)^Standards!E2)","v":1556.2900277539395},null,2854.2377122195503,null,null,null,"JOF",{"$f":"IF(OR(D$4=\"Boys 1\",D$4=\"Girls 1\"),\"n/a\",Standards!J$2+T9)","v":0.2},0,null,{"$f":"LEFT(VLOOKUP(3,scored,3,FALSE),FIND(\",\",VLOOKUP(3,scored,3,FALSE))-1)","v":"Grau"},{"$f":"(VLOOKUP(3,scored,5,FALSE)-$S$7)/($F$5-$S$7)","v":0.75},{"$f":"VLOOKUP(3,scored,6,FALSE)/$G$5","v":0.40363636363636363},{"$f":"IF(OR(D2=\"G1\",D2=\"B1\"),\"n/a\",(VLOOKUP(3,scored,7,FALSE)-($S$9*$H$5))/(0.85*$H$5))","v":0.96309828279137755},null,{"$f":"IF(OR(D2=\"G1\",D2=\"B1\"),W9+X9,W9+X9+Y9)","v":2.1167346464277412}]
[null,4,null,"Haines, Hutch",null,97.5,1010,154,null,{"$f":"IF(F10=\"\",0,(Standards!AF10/Standards!AF$5*multiplier)^exponent)","v":1324.091603104866},99.638034967115132,{"$f":"IF(OR(D$4=\"Boys 1\",D$4=\"Girls 1\",H10=\"\"),0,(Standards!AG10/Standards!AG$5*multiplier)^Standards!E2)","v":1371.7075830183487},null,2795.4372210903298]
[null,5,null,"Snape, R Scott",null,94,1140,141,null,{"$f":"IF(F11=\"\",0,(Standards!AF11/Standards!AF$5*multiplier)^exponent)","v":1193.0389105291338},120.93686824047289,{"$f":"IF(OR(D$4=\"Boys 1\",D$4=\"Girls 1\",H11=\"\"),0,(Standards!AG11/Standards!AG$5*multiplier)^Standards!E2)","v":1145.0701955802831},null,2459.0459743498895,null,null,null,"Overall multiple",null,1500,null,"Separation using new calc",null,null,{"$f":"LEFT(VLOOKUP(1,scored,3,FALSE),FIND(\",\",VLOOKUP(1,scored,3,FALSE))-1) & \" vs \" & LEFT(VLOOKUP(2,scored,3,FALSE),FIND(\",\",VLOOKUP(2,scored,3,FALSE))-1)","v":"Whetsel vs Newman"}]
[null,6,null,"Webb, Greg",null,86,1940,140,null,{"$f":"IF(F12=\"\",0,(Standards!AF12/Standards!AF$5*multiplier)^exponent)","v":913.21606072525788},283.13510779725669,{"$f":"IF(OR(D$4=\"Boys 1\",D$4=\"Girls 1\",H12=\"\"),0,(Standards!AG12/Standards!AG$5*multiplier)^Standards!E2)","v":1128.2774168877945},null,2324.6285854103089,null,null,null,null,null,null,null,null,null,"S","T","J","Overall"]
[null,7,null,"Lindsey, Jeff",null,90.5,2170,127,null,{"$f":"IF(F13=\"\",0,(Standards!AF13/Standards!AF$5*multiplier)^exponent)","v":1067.1759766198609},338.72443733086055,{"$f":"IF(OR(D$4=\"Boys 1\",D$4=\"Girls 1\",H13=\"\"),0,(Standards!AG13/Standards!AG$5*multiplier)^Standards!E2)","v":918.58472210391449},null,2324.4851360546359,null,null,null,null,null,null,null,"Calculated",null,{"$f":"VLOOKUP(1,scored,9,FALSE)-VLOOKUP(2,scored,9,FALSE)","v":17.981273842928431},{"$f":"VLOOKUP(1,scored,10,FALSE)-VLOOKUP(2,scored,10,FALSE)","v":-69.660861980355605},{"$f":"VLOOKUP(1,scored,11,FALSE)-VLOOKUP(2,scored,11,FALSE)","v":54.720147947210535},{"$f":"VLOOKUP(1,B6:N16,13,FALSE)-VLOOKUP(2,B6:N16,13,FALSE)","v":3.0405598097836446}]
[null,8,null,"Estes, Robbie",null,94,1370,123,null,{"$f":"IF(F14=\"\",0,(Standards!AF14/Standards!AF$5*multiplier)^exponent)","v":1193.0389105291338},162.27957562450109,{"$f":"IF(OR(D$4=\"Boys 1\",D$4=\"Girls 1\",H14=\"\"),0,(Standards!AG14/Standards!AG$5*multiplier)^Standards!E2)","v":857.36003582457636},null,2212.6785219782114,null,null,null,null,null,null,null,"Raw score difference",null,{"$f":"VLOOKUP(1,scored,5,FALSE)-VLOOKUP(2,scored,5,FALSE)","v":0.5},{"$f":"VLOOKUP(1,scored,6,FALSE)-VLOOKUP(2,scored,6,FALSE)","v":-260},{"$f":"VLOOKUP(1,scored,7,FALSE)-VLOOKUP(2,scored,7,FALSE)","v":3}]
[null,10,null,"Budzynski, Mark",null,98,1330,102,null,{"$f":"IF(F15=\"\",0,(Standards!AF15/Standards!AF$5*multiplier)^exponent)","v":1343.2291302242224},154.76529555226639,{"$f":"IF(OR(D$4=\"Boys 1\",D$4=\"Girls 1\",H15=\"\"),0,(Standards!AG15/Standards!AG$5*multiplier)^Standards!E2)","v":562.85244167471649},null,2060.8468674512055]
[null,9,null,"Wenzel, Norman",null,88,320,138,null,{"$f":"IF(F16=\"\",0,(Standards!AF16/Standards!AF$5*multiplier)^exponent)","v":980.53203961707698},15.839844769095794,{"$f":"IF(OR(D$4=\"Boys 1\",D$4=\"Girls 1\",H16=\"\"),0,(Standards!AG16/Standards!AG$5*multiplier)^Standards!E2)","v":1094.9718304427317},null,2091.3437148289045]
[]
[null,null,null,null,null,null,null,null,null,null,null,null,null,null,null,{"$f":"HLOOKUP(HLOOKUP(T3,countAdj,3,FALSE),buoyCount,2,FALSE)","v":66},null,"From 2013 Nationals",null,null,null,"T","J","Total",null,null,"Placement change"]
[null,null,null,null,null,null,null,null,null,null,null,null,null,null,null,null,null,{"$f":"LEFT(S21,FIND(\",\",S21)-1) & \" vs \" & LEFT(S22,FIND(\",\",S22)-1)","v":"Whetsel vs Newman"},null,null,{"$f":"U21-U22","v":15},{"$f":"V21-V22","v":-38.800000000000068},{"$f":"W21-W22","v":37},{"$f":"X21-X22","v":13.199999999999818}]
[null,null,null,"Slalom info:"]
[null,null,null,{"$f":"D7","v":"Whetsel, Kirby"},null,{"$f":"IF(MOD(F7,6)=0,6,MOD(F7,6))","v":2.5},"@",{"$f":"IF(F7>$P$18,HLOOKUP(IF(F7>$P$18,INT(F7/6)+IF(F7>$P$18,HLOOKUP($T$3,countAdj,4,FALSE),0)+IF(F21<6,1,0),0),buoyOffset,2,FALSE) & \"m\",HLOOKUP(INT(F7/6)+IF(F21<6,1,0),buoyOffset,2,FALSE) & \"k\")","v":"12m"},null,null,null,null,null,null,null,null,null,1,"Whetsel, Kirby",null,598.5,697.8,1233.0999999999999,2529.3999999999996,null,{"$f":"IFERROR(R21-B7,\"\")","v":0}]
[null,null,null,{"$f":"D8","v":"Newman, Thomas"},null,2,"@","12m",null,null,null,null,null,null,null,null,null,2,"Newman, Thomas",null,583.5,736.6,1196.0999999999999,2516.1999999999998,null,0]
[null,null,null,"Grau, Mitch",null,3,"@","13m",null,null,null,null,null,null,null,null,null,3,"Grau, Mitch",null,450.4,683.9,1308.0999999999999,2442.3999999999996,null,0]
[null,null,null,"Haines, Hutch",null,1.5,"@","11.25m",null,null,null,null,null,null,null,null,null,4,"Haines, Hutch",null,767.7,458.4,1183.8,2409.8999999999996,null,0]
[null,null,null,"Snape, R Scott",null,4,"@","12m",null,null,null,null,null,null,null,null,null,5,"Snape, R Scott",null,645.5,487.4,1026.8,2159.6999999999998,null,0]
[null,null,null,"Webb, Greg",null,2,"@","13m",null,null,null,null,null,null,null,null,null,6,"Webb, Greg",null,427.2,638.6,1015,2080.8000000000002,null,0]
[null,null,null,"Lindsey, Jeff",null,0.5,"@","12m",null,null,null,null,null,null,null,null,null,7,"Lindsey, Jeff",null,540.29999999999995,676,864,2080.3000000000002,null,0]
[null,null,null,"Estes, Robbie",null,4,"@","12m",null,null,null,null,null,null,null,null,null,8,"Estes, Robbie",null,645.5,535.1,818.8,1999.3999999999999,null,0]
[null,null,null,"Budzynski, Mark",null,2,"@","11.25m",null,null,null,null,null,null,null,null,null,9,"Budzynski, Mark",null,786.7,527.1,591.6,1905.4,null,-1]
[null,null,null,"Wenzel, Norman",null,4,"@","13m",null,null,null,null,null,null,null,null,null,10,"Wenzel, Norman",null,474.6,255.6,991.4,1721.6,null,1]
[null,null,null,null,null,null,null,null,null,null,null,null,null,null,null,null,null,null,null,null,null,null,null,null,null,{"$f":"IFERROR(R31-#REF!,\"\")","v":""}]

{"sheet":"Standards","index":1,"n_rows":37,"n_cols":33,"rows_kept":37,"cut":false,"hidden":false,"merged":[[42,8,42,9],[41,8,41,9],[1,12,1,13],[0,12,0,13],[1,31,1,32]]}
[null,null,"Overall multiple",null,{"$f":"Calculator!T11","v":1500},null,"System",null,"SOF","JOF",null,null,"Multiplier",null,null,"Method",null,"Year",null,null,null,null,null,"Rates","sof adj","jof adj"]
[null,null,"Growth rate",null,{"$f":"Calculator!T5","v":1.6},null,1000,null,48,0.2,null,null,{"$f":"10^(LOG(E1)/E2)","v":96.617776104230373},null,null,"Standard1",null,"2011",null,null,null,null,null,1,-48,-0.15,null,null,null,null,null,"adj raw score"]
[null,null,null,null,null,null,1500,null,null,null,null,null,null,null,null,"Standard2",null,"2012",null,null,null,null,null,1.25,-42,-0.1,null,null,null,null,null,{"$f":"VLOOKUP(Calculator!$D$4,Standards!$D$7:$J$39,7,FALSE)","v":0},{"$f":"VLOOKUP(Calculator!$D$4,Standards!$D$7:$J$39,7,FALSE)","v":0}]
[null,null,null,null,null,null,null,null,null,null,null,null,null,null,null,"Records",null,"2013",null,null,null,null,null,1.5,-36,-0.05]
[null,null,null,null,null,null,null,null,null,null,null,null,null,null,null,"TopScore",null,null,null,null,null,null,null,1.6,-30,0,null,null,null,null,null,{"$f":"IF(Calculator!F5<=Calculator!J$3,0,Calculator!F5-Calculator!J$3)","v":60},{"$f":"IF(OR(Calculator!D$4=\"Boys 1\",Calculator!D$4=\"Girls 1\"),\"n/a\",IF(Calculator!H5<=Calculator!H$5*Calculator!L$3,0,Calculator!H5-Calculator!H$5*Calculator!L$3))","v":128.80000000000001}]
[null,"DivisionNames",null,null,"S","T","J","SOF","adj",null,null,"Standard 1",null,null,null,"Records",null,null,null,"TopScore",null,"avg",null,1.75,-24,0.05,null,"Standard 2"]
[null,"B1",null,"Boys 1",73,4000,"n/a",{"$f":"$I$2-I7","v":30},18,null,null,81,4090,"n/a",null,81,4090,"n/a",null,79.67,2333,"n/a",null,2,-18,0.1,null,73,4000,"n/a",null,{"$f":"IF(Calculator!F7<=Calculator!J$3,0,Calculator!F7-Calculator!J$3)","v":50.5},{"$f":"IF(OR(Calculator!D$4=\"Boys 1\",Calculator!D$4=\"Girls 1\"),\"n/a\",IF(Calculator!H7<=Calculator!H$5*Calculator!L$3,0,Calculator!H7-Calculator!H$5*Calculator!L$3))","v":125.8}]
[null,"B2",null,"Boys 2",94,7000,129,{"$f":"$I$2-I8","v":42},6,null,null,104,7870,143,null,104,7870,143,null,100.67,4410,138,null,null,-12,0.15,null,94,7000,129,null,{"$f":"IF(Calculator!F8<=Calculator!J$3,0,Calculator!F8-Calculator!J$3)","v":50},{"$f":"IF(OR(Calculator!D$4=\"Boys 1\",Calculator!D$4=\"Girls 1\"),\"n/a\",IF(Calculator!H8<=Calculator!H$5*Calculator!L$3,0,Calculator!H8-Calculator!H$5*Calculator!L$3))","v":122.8}]
[null,"B3",null,"Boys 3",105,9000,172,48,0,null,null,117,9000,191,null,117,10430,191,null,111.5,6940,186,null,null,-6,0.2,null,105,9000,172,null,{"$f":"IF(Calculator!F9<=Calculator!J$3,0,Calculator!F9-Calculator!J$3)","v":45},{"$f":"IF(OR(Calculator!D$4=\"Boys 1\",Calculator!D$4=\"Girls 1\"),\"n/a\",IF(Calculator!H9<=Calculator!H$5*Calculator!L$3,0,Calculator!H9-Calculator!H$5*Calculator!L$3))","v":131.80000000000001}]
[null,"G1",null,"Girls 1",72,5000,"n/a",30,18,null,null,80,5340,"n/a",null,80,5340,"n/a",null,68.17,3360,"n/a",null,null,0,0.25,null,72,5000,"n/a",null,{"$f":"IF(Calculator!F10<=Calculator!J$3,0,Calculator!F10-Calculator!J$3)","v":55.5},{"$f":"IF(OR(Calculator!D$4=\"Boys 1\",Calculator!D$4=\"Girls 1\"),\"n/a\",IF(Calculator!H10<=Calculator!H$5*Calculator!L$3,0,Calculator!H10-Calculator!H$5*Calculator!L$3))","v":121.8}]
[null,"G2",null,"Girls 2",86,6000,108,36,12,null,null,93,6790,120,null,95,6790,120,null,91.67,7215,104.5,null,null,6,null,null,86,6000,108,null,{"$f":"IF(Calculator!F11<=Calculator!J$3,0,Calculator!F11-Calculator!J$3)","v":52},{"$f":"IF(OR(Calculator!D$4=\"Boys 1\",Calculator!D$4=\"Girls 1\"),\"n/a\",IF(Calculator!H11<=Calculator!H$5*Calculator!L$3,0,Calculator!H11-Calculator!H$5*Calculator!L$3))","v":108.8}]
[null,"G3",null,"Girls 3",90,7000,139,42,6,null,null,100,8000,154,null,100,9230,154,null,101.25,9580,127,null,null,12,null,null,90,7000,139,null,{"$f":"IF(Calculator!F12<=Calculator!J$3,0,Calculator!F12-Calculator!J$3)","v":44},{"$f":"IF(OR(Calculator!D$4=\"Boys 1\",Calculator!D$4=\"Girls 1\"),\"n/a\",IF(Calculator!H12<=Calculator!H$5*Calculator!L$3,0,Calculator!H12-Calculator!H$5*Calculator!L$3))","v":107.8}]
[null,"M1",null,"Men 1",109,9000,188,48,0,null,null,121,8000,209,null,121,11070,209,null,122,9113,203.3,null,null,18,null,null,109,9000,188,null,{"$f":"IF(Calculator!F13<=Calculator!J$3,0,Calculator!F13-Calculator!J$3)","v":48.5},{"$f":"IF(OR(Calculator!D$4=\"Boys 1\",Calculator!D$4=\"Girls 1\"),\"n/a\",IF(Calculator!H13<=Calculator!H$5*Calculator!L$3,0,Calculator!H13-Calculator!H$5*Calculator!L$3))","v":94.8}]
[null,"M2",null,"Men 2",110,9000,194,48,0,null,null,122,8000,216,null,122,12090,216,null,121.5,5653,185,null,null,24,null,null,110,9000,194,null,{"$f":"IF(Calculator!F14<=Calculator!J$3,0,Calculator!F14-Calculator!J$3)","v":52},{"$f":"IF(OR(Calculator!D$4=\"Boys 1\",Calculator!D$4=\"Girls 1\"),\"n/a\",IF(Calculator!H14<=Calculator!H$5*Calculator!L$3,0,Calculator!H14-Calculator!H$5*Calculator!L$3))","v":90.8}]
[null,"M3",null,"Men 3",104,7000,178,42,6,null,null,115.25,7000,198,null,115.25,12070,198,null,111,7270,175.5,null,null,30,null,null,104,7000,178,null,{"$f":"IF(Calculator!F15<=Calculator!J$3,0,Calculator!F15-Calculator!J$3)","v":56},{"$f":"IF(OR(Calculator!D$4=\"Boys 1\",Calculator!D$4=\"Girls 1\"),\"n/a\",IF(Calculator!H15<=Calculator!H$5*Calculator!L$3,0,Calculator!H15-Calculator!H$5*Calculator!L$3))","v":69.8}]
[null,"M4",null,"Men 4",102,5500,161,42,6,null,null,112,6000,179,null,113,10420,179,null,112.17,6185,172.3,null,null,36,null,null,102,5500,161,null,{"$f":"IF(Calculator!F16<=Calculator!J$3,0,Calculator!F16-Calculator!J$3)","v":46},{"$f":"IF(OR(Calculator!D$4=\"Boys 1\",Calculator!D$4=\"Girls 1\"),\"n/a\",IF(Calculator!H16<=Calculator!H$5*Calculator!L$3,0,Calculator!H16-Calculator!H$5*Calculator!L$3))","v":105.8}]
[null,"M5",null,"Men 5",100,5000,140,42,6,null,null,111,5490,156,null,111,5490,156,null,110.5,4413,155.30000000000001,null,null,42,null,null,100,5000,140]
[null,"M6",null,"Men 6",94,3000,116,42,6,null,null,104.5,3940,129,null,104.5,3940,129,null,104.75,3015,122.7,null,null,48,null,null,94,3000,116]
[null,"M7",null,"Men 7",90,2500,101,36,12,null,null,95,3750,112,null,99.5,3750,112,null,100.83,3076,86.5,null,null,null,null,null,90,2500,101]
[null,"M8",null,"Men 8",79,2000,85,30,18,null,null,88.25,2450,94,null,88.25,2450,94,null,86.17,1907,81.400000000000006,null,null,null,null,null,79,2000,85]
[null,"M9",null,"Men 9",73,1500,79,30,18,null,null,81.5,1740,72,null,81.5,1740,88,null,86.5,1872,84.7,null,null,null,null,null,73,1500,79]
[null,"M10",null,"Men 10",66,1100,42,30,18,null,null,73.5,1600,47,null,73.5,1600,47,null,62.33,891,45.3,null,null,null,null,null,66,1100,42]
[null,"M11",null,"Men 11",34,900,20,36,12,null,null,40,600,34,null,38,1050,22,null,36.1,1197,20.9,null,null,null,null,null,34,900,20]
[null,"W1",null,"Women 1",98,7000,140,42,6,null,null,109,7000,155,null,109,8930,155,null,103.5,5625,173,null,null,null,null,null,98,7000,140]
[null,"W2",null,"Women 2",100,7000,142,42,6,null,null,111,7000,158,null,111,8990,158,null,97.83,8890,125,null,null,null,null,null,100,7000,142]
[null,"W3",null,"Women 3",95,6000,140,42,6,null,null,105,6450,155,null,105,6450,155,null,105.67,4585,139,null,null,null,null,null,95,6000,140]
[null,"W4",null,"Women 4",90,5500,110,42,6,null,null,100.5,5600,122,null,100.5,5600,122,null,98.5,4545,103,null,null,null,null,null,90,5500,110]
[null,"W5",null,"Women 5",83,4000,96,36,12,null,null,92,5060,107,null,92,5060,107,null,88.75,3380,82.7,null,null,null,null,null,83,4000,96]
[null,"W6",null,"Women 6",80,3000,86,36,12,null,null,88,3780,84,null,89,3780,95,null,88.25,4158,87.4,null,null,null,null,null,80,3000,86]
[null,"W7",null,"Women 7",72,2500,62,30,18,null,null,80,3330,69,null,80,3330,69,null,72.75,1857,59,null,null,null,null,null,72,2500,62]
[null,"W8",null,"Women 8",68,2000,51,30,18,null,null,75.5,2270,57,null,75.5,2270,57,null,64.5,180,0,null,null,null,null,null,68,2000,51]
[null,"W9",null,"Women 9",59,1500,40,24,24,null,null,65.5,1670,45,null,65.5,1670,45,null,59.72,1045,0,null,null,null,null,null,59,1500,40]
[null,"W10",null,"Women 10",50,1000,20,24,24,null,null,56,1220,32,null,56,1220,22,null,37.049999999999997,1197,0,null,null,null,null,null,50,1000,20]
[null,"W11",null,"Women 11",36,200,20,24,24,null,null,40,600,32,null,40,200,22,null,0,0,0,null,null,null,null,null,36,200,20]
[null,"OM",null,"Open Men",121,12090,247,48,0,null,null,122,10000,247,null,122,12090,247,null,122,11250,238.5,null,null,null,null,null,121,12090,247]
[null,"OW",null,"Open Women",111,9230,176,42,6,null,null,111,8990,176,null,111,9230,176,null,111.25,9580,173,null,null,null,null,null,111,9230,176]
[null,"MM",null,"Masters Men",115.25,11570,215,42,6,null,null,115.25,9000,215,null,115.25,11570,215,null,115.25,7270,207.3,null,null,null,null,null,115.25,11570,215]

{"sheet":"Records","index":2,"n_rows":80,"n_cols":19,"rows_kept":80,"cut":false,"hidden":false,"merged":[]}
["Records",null,null,"Jan 4, 2013"]
[]
["B1",null,null,null,null,null,null,null,"G1",null,null,null,null,null,null,"Records condensed"]
["Slalom",null,{"$f":"D4+HLOOKUP(F4,buoyCount,2,0)-6+IF(COUNTIF(SpdOnly,F4)=1,0,HLOOKUP(A3,countAdj,2,0))","v":81},3,"@",12,null,null,"Slalom",null,{"$f":"L4+HLOOKUP(N4,buoyCount,2,0)-6+IF(COUNTIF(SpdOnly,N4)=1,0,HLOOKUP(I3,countAdj,2,0))","v":80},2,"@",12,null,"B1",{"$f":"C4","v":81},{"$f":"C5","v":4090},"n/a"]
["Tricks",null,4090,null,null,null,null,null,"Tricks",null,5340,null,null,null,null,"B2",{"$f":"C8","v":104},{"$f":"C9","v":7870},{"$f":"C10","v":143}]
[null,null,null,null,null,null,null,null,null,null,null,null,null,null,null,"B3",{"$f":"C13","v":117},{"$f":"C14","v":10430},{"$f":"C15","v":191}]
["B2",null,null,null,null,null,null,null,"G2",null,null,null,null,null,null,"G1",{"$f":"K4","v":80},{"$f":"K5","v":5340},"n/a"]
["Slalom",null,{"$f":"D8+HLOOKUP(F8,buoyCount,2,0)-6+IF(COUNTIF(SpdOnly,F8)=1,0,HLOOKUP(A7,countAdj,2,0))","v":104},2,"@",10.75,null,null,"Slalom",null,{"$f":"L8+HLOOKUP(N8,buoyCount,2,0)-6+IF(COUNTIF(SpdOnly,N8)=1,0,HLOOKUP(I7,countAdj,2,0))","v":95},5,"@",11.25,null,"G2",{"$f":"K8","v":95},{"$f":"K9","v":6790},{"$f":"K10","v":120}]
["Tricks",null,7870,null,null,null,null,null,"Tricks",null,6790,null,null,null,null,"G3",{"$f":"K13","v":100},{"$f":"K14","v":9230},{"$f":"K15","v":154}]
["Jump",null,143,null,43.5,null,null,null,"Jump",null,120,null,null,null,null,"M1",{"$f":"C23","v":121},{"$f":"C24","v":11070},{"$f":"C25","v":209}]
[null,null,null,null,null,null,null,null,null,null,null,null,null,null,null,"M2",{"$f":"C28","v":122},{"$f":"C29","v":12090},{"$f":"C30","v":216}]
["B3",null,null,null,null,null,null,null,"G3",null,null,null,null,null,null,"M3",{"$f":"C38","v":115.25},{"$f":"C39","v":12070},{"$f":"C40","v":198}]
["Slalom",null,{"$f":"D13+HLOOKUP(F13,buoyCount,2,0)-6+IF(COUNTIF(SpdOnly,F13)=1,0,HLOOKUP(A12,countAdj,2,0))","v":117},3,"@",10.25,null,null,"Slalom",null,{"$f":"L13+HLOOKUP(N13,buoyCount,2,0)-6+IF(COUNTIF(SpdOnly,N13)=1,0,HLOOKUP(I12,countAdj,2,0))","v":100},4,"@",11.25,null,"M4",{"$f":"C43","v":113},{"$f":"C44","v":10420},{"$f":"C45","v":179}]
["Tricks",null,10430,null,null,null,null,null,"Tricks",null,9230,null,null,null,null,"M5",{"$f":"C48","v":111},{"$f":"C49","v":5490},{"$f":"C50","v":156}]
["Jump",null,191,null,null,null,null,null,"Jump",null,154,null,null,null,null,"M6",{"$f":"C53","v":104.5},{"$f":"C54","v":3940},{"$f":"C55","v":129}]
[null,null,null,null,null,null,null,null,null,null,null,null,null,null,null,"M7",{"$f":"C58","v":99.5},{"$f":"C59","v":3750},{"$f":"C60","v":112}]
["OM",null,null,null,null,null,null,null,"OW",null,null,null,null,null,null,"M8",{"$f":"C63","v":88.25},{"$f":"C64","v":2450},{"$f":"C65","v":94}]
["Slalom",null,{"$f":"D18+HLOOKUP(F18,buoyCount,2,0)-6+IF(COUNTIF(SpdOnly,F18)=1,0,HLOOKUP(A17,countAdj,2,0))","v":122},2,"@",9.75,null,null,"Slalom",null,{"$f":"L18+HLOOKUP(N18,buoyCount,2,0)-6+IF(COUNTIF(SpdOnly,N18)=1,0,HLOOKUP(I17,countAdj,2,0))","v":111},3,"@",10.25,null,"M9",{"$f":"C68","v":81.5},{"$f":"C69","v":1740},{"$f":"C70","v":88}]
["Tricks",null,12090,null,null,null,null,null,"Tricks",null,9230,null,null,null,null,"M10",{"$f":"C73","v":73.5},{"$f":"C74","v":1600},{"$f":"C75","v":47}]
["Jump",null,247,null,75.2,null,null,null,"Jump",null,176,null,null,53.6,null,"M11",{"$f":"C78","v":38},{"$f":"C79","v":1050},{"$f":"C80","v":22}]
[null,null,null,null,null,null,null,null,null,null,null,null,null,null,null,"W1",{"$f":"K23","v":109},{"$f":"K24","v":8930},{"$f":"K25","v":155}]
["M1",null,null,null,null,null,null,null,"W1",null,null,null,null,null,null,"W2",{"$f":"K28","v":111},{"$f":"K29","v":8990},{"$f":"K30","v":158}]
["Slalom",null,{"$f":"D23+HLOOKUP(F23,buoyCount,2,0)-6+IF(COUNTIF(SpdOnly,F23)=1,0,HLOOKUP(A22,countAdj,2,0))","v":121},1,"@",9.75,null,null,"Slalom",null,{"$f":"L23+HLOOKUP(N23,buoyCount,2,0)-6+IF(COUNTIF(SpdOnly,N23)=1,0,HLOOKUP(I22,countAdj,2,0))","v":109},1,"@",10.25,null,"W3",{"$f":"K38","v":105},{"$f":"K39","v":6450},{"$f":"K40","v":155}]
["Trick",null,11070,null,null,null,null,null,"Tricks",null,8930,null,null,null,null,"W4",{"$f":"K43","v":100.5},{"$f":"K44","v":5600},{"$f":"K45","v":122}]
["Jump",null,209,null,63.7,null,null,null,"Jump",null,155,null,null,null,null,"W5",{"$f":"K48","v":92},{"$f":"K49","v":5060},{"$f":"K50","v":107}]
[null,null,null,null,null,null,null,null,null,null,null,null,null,null,null,"W6",{"$f":"K53","v":89},{"$f":"K54","v":3780},{"$f":"K55","v":95}]
["M2",null,null,null,null,null,null,null,"W2",null,null,null,null,null,null,"W7",{"$f":"K58","v":80},{"$f":"K59","v":3330},{"$f":"K60","v":69}]
["Slalom",null,{"$f":"D28+HLOOKUP(F28,buoyCount,2,0)-6+IF(COUNTIF(SpdOnly,F28)=1,0,HLOOKUP(A27,countAdj,2,0))","v":122},2,"@",9.75,null,null,"Slalom",null,{"$f":"L28+HLOOKUP(N28,buoyCount,2,0)-6+IF(COUNTIF(SpdOnly,N28)=1,0,HLOOKUP(I27,countAdj,2,0))","v":111},3,"@",10.25,null,"W8",{"$f":"K63","v":75.5},{"$f":"K64","v":2270},{"$f":"K65","v":57}]
["Tricks",null,12090,null,null,null,null,null,"Tricks",null,8990,null,null,null,null,"W9",{"$f":"K68","v":65.5},{"$f":"K69","v":1670},{"$f":"K70","v":45}]
["Jump",null,216,null,null,null,null,null,"Jump",null,158,null,null,null,null,"W10",{"$f":"K73","v":56},{"$f":"K74","v":1220},{"$f":"K75","v":0}]
[null,null,null,null,null,null,null,null,null,null,null,null,null,null,null,"W11",{"$f":"K78","v":40},{"$f":"K79","v":200},{"$f":"K80","v":0}]
["MM",null,null,null,null,null,null,null,"MW",null,null,null,null,null,null,"OM",{"$f":"C18","v":122},{"$f":"C19","v":12090},{"$f":"C20","v":247}]
["Slalom",null,{"$f":"D33+HLOOKUP(F33,buoyCount,2,0)-6+IF(COUNTIF(SpdOnly,F33)=1,0,HLOOKUP(A32,countAdj,2,0))","v":115.25},1.25,"@",9.75,null,null,null,null,null,null,null,null,null,"OW",{"$f":"K18","v":111},{"$f":"K19","v":9230},{"$f":"K20","v":176}]
["Tricks",null,11570,null,null,null,null,null,null,null,null,null,null,null,null,"MM",{"$f":"C33","v":115.25},{"$f":"C34","v":11570},{"$f":"C35","v":215}]
["Jump",null,215,null,65.5]
[]
["M3",null,null,null,null,null,null,null,"W3"]
["Slalom",null,{"$f":"D38+HLOOKUP(F38,buoyCount,2,0)-6+IF(COUNTIF(SpdOnly,F38)=1,0,HLOOKUP(A37,countAdj,2,0))","v":115.25},1.25,"@",9.75,null,null,"Slalom",null,{"$f":"L38+HLOOKUP(N38,buoyCount,2,0)-6+IF(COUNTIF(SpdOnly,N38)=1,0,HLOOKUP(I37,countAdj,2,0))","v":105},3,"@",10.75]
["Trick",null,12070,null,null,null,null,null,"Tricks",null,6450]
["Jump",null,198,null,60.5,null,null,null,"Jump",null,155]
[]
["M4",null,null,null,null,null,null,null,"W4"]
["Slalom",null,{"$f":"D43+HLOOKUP(F43,buoyCount,2,0)-6+IF(COUNTIF(SpdOnly,F43)=1,0,HLOOKUP(A42,countAdj,2,0))","v":113},5,"@",10.25,null,null,"Slalom",null,{"$f":"L43+HLOOKUP(N43,buoyCount,2,0)-6+IF(COUNTIF(SpdOnly,N43)=1,0,HLOOKUP(I42,countAdj,2,0))","v":100.5},4.5,"@",11.25]
["Trick",null,10420,null,null,null,null,null,"Tricks",null,5600]
["Jump",null,179,null,54.5,null,null,null,"Jump",null,122]
[]
["M5",null,null,null,null,null,null,null,"W5"]
["Slalom",null,{"$f":"D48+HLOOKUP(F48,buoyCount,2,0)-6+IF(COUNTIF(SpdOnly,F48)=1,0,HLOOKUP(A47,countAdj,2,0))","v":111},3,"@",10.25,null,null,"Slalom",null,{"$f":"L48+HLOOKUP(N48,buoyCount,2,0)-6+IF(COUNTIF(SpdOnly,N48)=1,0,HLOOKUP(I47,countAdj,2,0))","v":92},2,"@",11.25]
["Tricks",null,5490,null,null,null,null,null,"Tricks",null,5060]
["Jump",null,156,null,null,null,null,null,"Jump",null,107]
[]
["M6",null,null,null,null,null,null,null,"W6"]
["Slalom",null,{"$f":"D53+HLOOKUP(F53,buoyCount,2,0)-6+IF(COUNTIF(SpdOnly,F53)=1,0,HLOOKUP(A52,countAdj,2,0))","v":104.5},2.5,"@",10.75,null,null,"Slalom",null,{"$f":"L53+HLOOKUP(N53,buoyCount,2,0)-6+IF(COUNTIF(SpdOnly,N53)=1,0,HLOOKUP(I52,countAdj,2,0))","v":89},5,"@",12]
["Tricks",null,3940,null,null,null,null,null,"Tricks",null,3780]
["Jump",null,129,null,39.4,null,null,null,"Jump",null,95]
[]
["M7",null,null,null,null,null,null,null,"W7"]
["Slalom",null,{"$f":"D58+HLOOKUP(F58,buoyCount,2,0)-6+IF(COUNTIF(SpdOnly,F58)=1,0,HLOOKUP(A57,countAdj,2,0))","v":99.5},3.5,"@",10.75,null,null,"Slalom",null,{"$f":"L58+HLOOKUP(N58,buoyCount,2,0)-6+IF(COUNTIF(SpdOnly,N58)=1,0,HLOOKUP(I57,countAdj,2,0))","v":80},2,"@",12]
["Tricks",null,3750,null,null,null,null,null,"Tricks",null,3330]
["Jump",null,112,null,null,null,null,null,"Jump",null,69]
[]
["M8",null,null,null,null,null,null,null,"W8"]
["Slalom",null,{"$f":"D63+HLOOKUP(F63,buoyCount,2,0)-6+IF(COUNTIF(SpdOnly,F63)=1,0,HLOOKUP(A62,countAdj,2,0))","v":88.25},4.25,"@",11.25,null,null,"Slalom",null,{"$f":"L63+HLOOKUP(N63,buoyCount,2,0)-6+IF(COUNTIF(SpdOnly,N63)=1,0,HLOOKUP(I62,countAdj,2,0))","v":75.5},3.5,"@",13]
["Tricks",null,2450,null,null,null,null,null,"Tricks",null,2270]
["Jump",null,94,null,null,null,null,null,"Jump",null,57]
[]
["M9",null,null,null,null,null,null,null,"W9"]
["Slalom",null,{"$f":"D68+HLOOKUP(F68,buoyCount,2,0)-6+IF(COUNTIF(SpdOnly,F68)=1,0,HLOOKUP(A67,countAdj,2,0))","v":81.5},3.5,"@",12,null,null,"Slalom",null,{"$f":"L68+HLOOKUP(N68,buoyCount,2,0)-6+IF(COUNTIF(SpdOnly,N68)=1,0,HLOOKUP(I67,countAdj,2,0))","v":65.5},5.5,"@",14.25]
["Tricks",null,1740,null,null,null,null,null,"Tricks",null,1670]
["Jump",null,88,null,26.8,null,null,null,"Jump",null,45]
[]
["M10",null,null,null,null,null,null,null,"W10"]
["Slalom",null,{"$f":"D73+HLOOKUP(F73,buoyCount,2,0)-6+IF(COUNTIF(SpdOnly,F73)=1,0,HLOOKUP(A72,countAdj,2,0))","v":73.5},1.5,"@",13,null,null,"Slalom",null,{"$f":"L73+HLOOKUP(N73,buoyCount,2,0)-6+IF(COUNTIF(SpdOnly,N73)=1,0,HLOOKUP(I72,countAdj,2,0))","v":56},2,"@",16]
["Trick",null,1600,null,null,null,null,null,"Tricks",null,1220]
["Jump",null,47,null,14.2,null,null,null,"Jump"]
[]
["M11",null,null,null,null,null,null,null,"W11"]
["Slalom",null,{"$f":"D78+HLOOKUP(F78,buoyCount,2,0)-6+IF(COUNTIF(SpdOnly,F78)=1,0,HLOOKUP(A77,countAdj,2,0))","v":38},2,"@",43,null,null,"Slalom",null,{"$f":"L78+HLOOKUP(N78,buoyCount,2,0)-6+IF(COUNTIF(SpdOnly,N78)=1,0,HLOOKUP(I77,countAdj,2,0))","v":40},4,"@",43]
["Tricks",null,1050,null,null,null,null,null,"Tricks",null,200]
["Jump",null,22,null,6.7,null,null,null,"Jump"]

{"sheet":"SlalomCalc","index":3,"n_rows":37,"n_cols":31,"rows_kept":37,"cut":false,"hidden":false,"merged":[]}
[]
[null,"Div",null,"Buoys",null,"Spd/Line",null,"Total",null,null,null,"Div",null,"Total",null,"Buoys",null,"Spd/Line"]
[null,"M8",null,4.25,"@",49,null,{"$f":"IF(F3>F5,\"error\",D3+HLOOKUP(F3,buoyCount,2,0)-6+IF(COUNTIF(SpdOnly,F3)=1,0,HLOOKUP(B3,countAdj,2,0)))","v":52.25},null,null,null,"W10",null,89,null,{"$f":"IF(MOD(N3,6)=0,6,MOD(N3,6))","v":5},"@",{"$f":"IF(N3>O5,HLOOKUP(IF(N3>O5,INT(N3/6)+IF(N3>O5,HLOOKUP(L3,countAdj,4,FALSE),0)+IF(P3<6,1,0),0),buoyOffset,2,FALSE) & \"m\",HLOOKUP(INT(N3/6)+IF(P3<6,1,0),buoyOffset,2,FALSE) & \"k\")","v":"10.75m"}]
[]
[null,null,null,"Max Spd",null,{"$f":"HLOOKUP(B3,countAdj,3,FALSE)","v":49},null,null,null,null,null,"Max Spd Count",null,null,{"$f":"HLOOKUP(HLOOKUP(L3,countAdj,3,FALSE),buoyCount,2,FALSE)","v":48}]
[]
["Offset",1,2,3,4,5,6,7,8,9,10,11,12,13,14,15,16,17,18,19,20,21]
["Spd/Line",25,28,31,34,37,40,43,46,49,52,55,58,18.25,16,14.25,13,12,11.25,10.75,10.25,9.75]
["Count",6,12,18,24,30,36,42,48,54,60,66,72,78,84,90,96,102,108,114,120,126]
[]
[]
["B1","B2","B3","G1","G2","G3","M1","M2","M3","M4","M5","M6","M7","M8","M9","M10","M11","W1","W2","W3","W4","W5","W6","W7","W8","W9","W10","W11","MM","OM","OW"]
[-18,-6,0,-18,-12,-6,0,0,-6,-6,-6,-6,-12,-18,-18,-18,-18,-6,-6,-6,-6,-12,-12,-18,-18,-24,-24,-24,-6,0,-6]
[49,55,58,49,52,55,58,58,55,55,55,55,52,49,49,49,49,55,55,55,55,52,52,49,49,46,46,46,55,58,55]
[3,1,0,3,2,1,0,0,1,1,1,1,2,3,3,3,3,1,1,1,1,2,2,3,3,4,4,4,1,0,1]
["90 buoy benchmark"]
[11.25,13,14.25,11.25,12,13,14.25,14.25,13,13,13,13,12,11.25,11.25,11.25,11.25,13,13,13,13,12,12,11.25,11.25,10.75,10.75,10.75,13,14.25,13]
[]
[null,"Buoys"]
[null,0.25]
[null,0.5]
[null,1]
[null,1.25]
[null,1.5]
[null,2]
[null,2.25]
[null,2.5]
[null,3]
[null,3.25]
[null,3.5]
[null,4]
[null,4.25]
[null,4.5]
[null,5]
[null,5.25]
[null,5.5]
[null,6]

{"sheet":"NatsData13","index":4,"n_rows":163,"n_cols":16,"rows_kept":163,"cut":false,"hidden":false,"merged":[]}
["Skier",null,"S","T","J","Div","Slalom result",null,null,null,"Skier",null,"S nops","T nops","J nops","NOPS"]
["Bryans, James",null,72.5,1540,null,"B1",0.5,49,1300,null,"Bryans, James",null,1341.8,908.8,null,2250.6]
["Roberts, Edward",null,63,1580,null,"B1",3,49,1600,null,"Roberts, Edward",null,1165.8,920.8,null,2086.6]
["Weber, Samuel",null,67.5,1240,null,"B1",1.5,49,1425,null,"Weber, Samuel",null,1249.0999999999999,813.2,null,2062.3000000000002]
["Arnold, Zachary",null,63,1060,null,"B1",3,49,1600,null,"Arnold, Zachary",null,1165.8,750.3,null,1916.1]
["Robbins, Evan",null,43.5,1980,null,"B1",1.5,46,2300,null,"Robbins, Evan",null,807.6,1033.9000000000001,null,1841.5]
["Keller, Brody",null,68.5,480,null,"B1",2.5,49,1425,null,"Keller, Brody",null,1267.5999999999999,499.8,null,1767.3999999999999]
["Panneton, Brian",null,68,440,null,"B1",2,49,1425,null,"Panneton, Brian",null,1258.4000000000001,477.9,null,1736.3000000000002]
["Grubbs, Blaze",null,63,280,null,"B1",3,49,1600,null,"Grubbs, Blaze",null,1165.8,379,null,1544.8]
["Hooten, Carter",null,32.5,1610,null,"B1",2.5,40,2300,null,"Hooten, Carter",null,607.9,929.8,null,1537.6999999999998]
["Waltrip, Luke",null,39.5,660,null,"B1",3.5,43,2300,null,"Waltrip, Luke",null,734.7,588.4,null,1323.1]
["Canepa, Ryan",null,103,3630,101,"B2",1,55,1075,null,"Canepa, Ryan",null,1473.2,1019.5,1121,3613.7]
["Haines, Quinn",null,93,3180,129,"B2",3,55,1200,null,"Haines, Quinn",null,1218,954.4,1379.1,3551.5]
["Fry, Colten",null,93,810,121,"B2",3,55,1200,null,"Fry, Colten",null,1218,482.3,1307.7,3008]
["Stallings, Garrett",null,85.5,4310,69,"B2",1.5,55,1300,null,"Stallings, Garrett",null,1041.5,1110.7,787.2,2939.3999999999996]
["Warner, Ryan",null,80,3120,89,"B2",2,55,1425,null,"Warner, Ryan",null,920.3,945.3,1001.9,2867.5]
["Melnar, Dylan",null,86,1630,96,"B2",2,55,1300,null,"Melnar, Dylan",null,1052.8,683.7,1072.0999999999999,2808.6]
["Stange, Griffin",null,90.5,1670,72,"B2",0.5,55,1200,null,"Stange, Griffin",null,1157.7,692,821,2670.7]
["Fisher, Trenton",null,80,3310,66,"B2",2,55,1425,null,"Fisher, Trenton",null,920.3,973.6,752.7,2646.6000000000004]
["Butterfield, Zachary",null,79.5,2590,59,"B2",1.5,55,1425,null,"Butterfield, Zachary",null,909.6,861.5,669.3,2440.3999999999996]
["Fowler, Garnet",null,91,450,76,"B2",1,55,1200,null,"Fowler, Garnet",null,1169.5999999999999,359.7,865.1,2394.4]
["Lang, Nicholas",null,97.5,6780,171,"B3",1.5,58,1200,null,"Lang, Nicholas",null,848.8,1191.3,1286.7,3326.8]
["Garcia, Taylor",null,100,4910,174,"B3",4,58,1200,null,"Garcia, Taylor",null,923.6,1002.4,1318.4,3244.4]
["Greenwood, Samuel",null,99,4290,171,"B3",3,58,1200,null,"Greenwood, Samuel",null,893.1,932.6,1286.7,3112.4]
["Mechler, Dane",null,106.5,3800,138,"B3",4.5,58,1125,null,"Mechler, Dane",null,1140.8,874,945.8,2960.6]
["Guyer, Corbin",null,98,4600,152,"B3",2,58,1200,null,"Guyer, Corbin",null,863.3,968,1088.5999999999999,2919.8999999999996]
["DeVito, Christian",null,98,4310,146,"B3",2,58,1200,null,"DeVito, Christian",null,863.3,934.9,1027,2825.2]
["Lindy, Taylor",null,99,2080,140,"B3",3,58,1200,null,"Lindy, Taylor",null,893.1,633.1,966,2492.1999999999998]
["MacIntyre, Zachary",null,99,4740,104,"B3",3,58,1200,null,"MacIntyre, Zachary",null,893.1,983.7,612.4,2489.2000000000003]
["Montgomery, Ryan",null,97,2730,106,"B3",1,58,1200,null,"Montgomery, Ryan",null,834.3,732.2,631.4,2197.9]
["Kelley, Joshua",null,94,1290,127,"B3",4,58,1300,null,"Kelley, Joshua",null,751.7,490.3,835.7,2077.6999999999998]
["Grathwohl, Allyson",null,51,3180,null,"G1",3,49,2300,null,"Grathwohl, Allyson",null,1018.5,1217.2,null,2235.6999999999998]
["Hansen, Kennedy",null,66,1630,null,"G1",6,49,1600,null,"Hansen, Kennedy",null,1268.5,929.8,null,2198.3000000000002]
["Janzig, Sophia",null,56,1420,null,"G1",2,49,1825,null,"Janzig, Sophia",null,1102.0999999999999,879.6,null,1981.6999999999998]
["Boskus, Brooke",null,56,1200,null,"G1",2,49,1825,null,"Boskus, Brooke",null,1102.0999999999999,821.9,null,1924]
["Drake, Alyssa",null,37,960,null,"G1",1,43,2300,null,"Drake, Alyssa",null,782.7,751.2,null,1533.9]
["Jones, Alana",null,40,660,null,"G1",4,43,2300,null,"Jones, Alana",null,833.5,645.9,null,1479.4]
["Krick, Olivia",null,39,440,null,"G1",3,43,2300,null,"Krick, Olivia",null,816.6,548.5,null,1365.1]
["Hauser, Natalie",null,21,380,null,"G1",3,34,2300,null,"Hauser, Natalie",null,508.8,517.1,null,1025.9000000000001]
["Baldwin, Brooke",null,91,5770,89,"G2",1,52,1125,null,"Baldwin, Brooke",null,1439.5,1375.6,1166.0999999999999,3981.2]
["Gay, Anna",null,89,5040,82,"G2",5,52,1200,null,"Gay, Anna",null,1380.1,1280.0999999999999,1084.9000000000001,3745.1]
["Grathwohl, Taylor",null,86,4310,83,"G2",2,52,1200,null,"Grathwohl, Taylor",null,1293.3,1177.8,1096.7,3567.8]
["Baldwin, Kristen",null,79.5,5070,88,"G2",1.5,52,1300,null,"Baldwin, Kristen",null,1114.3,1284.0999999999999,1154.7,3553.0999999999995]
["Morgan, Emma",null,80,3020,87,"G2",2,52,1300,null,"Morgan, Emma",null,1127.5999999999999,974.8,1143.2,3245.5999999999995]
["Grathwohl, Bailey",null,73.5,4250,72,"G2",1.5,52,1425,null,"Grathwohl, Bailey",null,960.4,1169.0999999999999,964.1,3093.6]
["Kosek, Tianna",null,85,1850,64,"G2",1,52,1200,null,"Kosek, Tianna",null,1264.9000000000001,751.1,862.4,2878.4]
["Blair, Hayleigh",null,76,2350,66,"G2",4,52,1425,null,"Blair, Hayleigh",null,1023.2,853,888.3,2764.5]
["Montgomery, Ashley",null,69,2200,75,"G2",3,52,1600,null,"Montgomery, Ashley",null,852.1,823.6,1001,2676.7]
["Newman, Charlsey",null,75,1290,67,"G2",3,52,1425,null,"Newman, Charlsey",null,997.8,620,901.2,2519]
["Lang, Erika",null,95,8990,124,"G3",5,55,1200,null,"Lang, Erika",null,1234.9000000000001,1500,1179,3913.9]
["Horton, Ellie",null,93,6250,118,"G3",3,55,1200,null,"Horton, Ellie",null,1139.5,1215.3,1114,3468.8]
["Grathwohl, Abbi",null,92,4690,116,"G3",2,55,1200,null,"Grathwohl, Abbi",null,1093.9000000000001,1029.0999999999999,1092.3,3215.3]
["Butterfield, Krista",null,91,4850,100,"G3",1,55,1200,null,"Butterfield, Krista",null,1049.8,1049.3,917.1,3016.2]
["Morgan, Jenna",null,88.5,3820,104,"G3",4.5,55,1300,null,"Morgan, Jenna",null,945.3,913.9,961.1,2820.2999999999997]
["Morris, Jaye",null,87.5,2610,119,"G3",3.5,55,1300,null,"Morris, Jaye",null,905.9,733,1124.9000000000001,2763.8]
["Warner, Kat",null,86.5,4080,100,"G3",2.5,55,1300,null,"Warner, Kat",null,867.7,949.4,917.1,2734.2]
["Boskus, Julianna",null,88,2160,86,"G3",4,55,1300,null,"Boskus, Julianna",null,925.4,656.9,761.5,2343.8000000000002]
["Daulton, Riley",null,76,1980,108,"G3",4,55,1600,null,"Daulton, Riley",null,537.5,624.6,1005,2167.1]
["Forni, Jenae",null,81,2310,68,"G3",3,55,1425,null,"Forni, Jenae",null,679.4,683,557.5,1919.9]
["Stevenson, Michael",null,104,5640,193,"M1",2,58,1125,null,"Stevenson, Michael",null,1028.3,1116.4000000000001,1386.3,3531]
["Karber, Garrett",null,105,3770,172,"M1",3,58,1125,null,"Karber, Garrett",null,1053,935.8,1234.2,3223]
["Phillips, Drew",null,101,3600,171,"M1",5,58,1200,null,"Phillips, Drew",null,956.2,917.1,1226.9000000000001,3100.2000000000003]
["Morris, Robert",null,99,4630,142,"M1",3,58,1200,null,"Morris, Robert",null,910,1024,1010.2,2944.2]
["Kachele, Zachary",null,96.5,3320,165,"M1",0.5,58,1200,null,"Kachele, Zachary",null,854.2,885.1,1182.7,2922]
["Kulig, Paul",null,105.5,1410,159,"M1",3.5,58,1125,null,"Kulig, Paul",null,1065.5,608.29999999999995,1138.2,2812]
["Zimmerman, Kyle",null,100,2360,143,"M1",4,58,1200,null,"Zimmerman, Kyle",null,932.9,762.2,1017.8,2712.8999999999996]
["Hinkle, Ryan",null,96.5,1620,156,"M1",0.5,58,1200,null,"Hinkle, Ryan",null,854.2,646.4,1115.9000000000001,2616.5]
["Cole, Randall",null,95.5,2220,135,"M1",5.5,58,1300,null,"Cole, Randall",null,832.5,742.1,956.5,2531.1]
["Evatt, Hank",null,94.5,2230,134,"M1",4.5,58,1300,null,"Evatt, Hank",null,811.1,743.6,948.8,2503.5]
["Barringer, Treece",null,101,3430,185,"M2",5,58,1200,null,"Barringer, Treece",null,870.1,820.4,1234.8,2925.3]
["Sparks, Brian",null,102,3430,161,"M2",6,58,1200,null,"Sparks, Brian",null,895,820.4,1031.4000000000001,2746.8]
["Mommer, Brett",null,87,1840,163,"M2",3,58,1425,null,"Mommer, Brett",null,570.1,608.79999999999995,1048.3,2227.1999999999998]
["Kodiak, Cris",null,68,2010,121,"M2",2,58,2300,null,"Kodiak, Cris",null,291.8,635.1,696.9,1623.8000000000002]
["Surdej, Jeff",null,97.5,4150,168,"M3",1.5,55,1125,null,"Surdej, Jeff",null,788.6,886.2,1190.0999999999999,2864.9]
["Eller, Christophe",null,104,1650,164,"M3",2,55,1075,null,"Eller, Christophe",null,1056.9000000000001,562.4,1149.5999999999999,2768.9]
["Hooten, Jody",null,92.5,3100,175,"M3",2.5,55,1200,null,"Hooten, Jody",null,622.9,767.5,1261.4000000000001,2651.8]
["Nichols, Donald",null,99.5,2340,150,"M3",3.5,55,1125,null,"Nichols, Donald",null,864.3,668.1,1009.7,2542.1000000000004]
["Bellefeuille, Scott",null,99,1610,123,"M3",3,55,1125,null,"Bellefeuille, Scott",null,844.8,555.6,748.2,2148.6000000000004]
["Ripley, Ryan",null,77.5,2420,98,"M3",5.5,55,1600,null,"Ripley, Ryan",null,291.8,679.3,518,1489.1]
["Combs, Jb",null,4,740,106,"M3",4,25,1825,null,"Combs, Jb",null,32,378.7,590.20000000000005,1000.9000000000001]
["Kazmer, Keith",null,63,2350,57,"M3",3,55,2300,null,"Kazmer, Keith",null,135.80000000000001,669.5,175.7,981]
["Whetsel, Kirby",null,92.5,2310,158,"M4",2.5,55,1200,null,"Whetsel, Kirby",null,598.5,697.8,1233.0999999999999,2529.3999999999996]
["Newman, Thomas",null,92,2570,155,"M4",2,55,1200,null,"Newman, Thomas",null,583.5,736.6,1196.0999999999999,2516.1999999999998]
["Grau, Mitch",null,87,2220,164,"M4",3,55,1300,null,"Grau, Mitch",null,450.4,683.9,1308.0999999999999,2442.3999999999996]
["Haines, Hutch",null,97.5,1010,154,"M4",1.5,55,1125,null,"Haines, Hutch",null,767.7,458.4,1183.8,2409.8999999999996]
["Snape, R Scott",null,94,1140,141,"M4",4,55,1200,null,"Snape, R Scott",null,645.5,487.4,1026.8,2159.6999999999998]
["Webb, Greg",null,86,1940,140,"M4",2,55,1300,null,"Webb, Greg",null,427.2,638.6,1015,2080.8000000000002]
["Lindsey, Jeff",null,90.5,2170,127,"M4",0.5,55,1200,null,"Lindsey, Jeff",null,540.29999999999995,676,864,2080.3000000000002]
["Estes, Robbie",null,94,1370,123,"M4",4,55,1200,null,"Estes, Robbie",null,645.5,535.1,818.8,1999.3999999999999]
["Budzynski, Mark",null,98,1330,102,"M4",2,55,1125,null,"Budzynski, Mark",null,786.7,527.1,591.6,1905.4]
["Wenzel, Norman",null,88,320,138,"M4",4,55,1300,null,"Wenzel, Norman",null,474.6,255.6,991.4,1721.6]
["Goodman, Terry",null,96.5,1910,139,"M5",0.5,55,1125,null,"Goodman, Terry",null,818.6,670.2,1265.7,2754.5]
["Rabe, Curtis",null,89,3060,124,"M5",5,55,1300,null,"Rabe, Curtis",null,567.6,960.3,1065.5999999999999,2593.5]
["Holm, Brian",null,92.5,1080,142,"M5",2.5,55,1200,null,"Holm, Brian",null,675.2,433.8,1306.5,2415.5]
["Mcclure, James",null,91,2110,118,"M5",1,55,1200,null,"Mcclure, James",null,627.20000000000005,723.1,987.5,2337.8000000000002]
["Luzoro, Joe",null,93,1500,114,"M5",3,55,1200,null,"Luzoro, Joe",null,691.9,557.4,936.1,2185.4]
["Armour, Paul",null,85.5,870,141,"M5",1.5,55,1300,null,"Armour, Paul",null,475,367.8,1292.8,2135.6]
["Pilcher, William",null,81.5,1430,135,"M5",3.5,55,1425,null,"Pilcher, William",null,385.5,537.4,1211.7,2134.6]
["Vosburgh, George",null,93,2370,91,"M5",3,55,1200,null,"Vosburgh, George",null,691.9,790.2,651.4,2133.5]
["Golly, David",null,92.5,2620,80,"M5",2.5,55,1200,null,"Golly, David",null,675.2,853,522.79999999999995,2051]
["Able, John",null,89,1740,93,"M5",5,55,1300,null,"Able, John",null,567.6,624.20000000000005,675.4,1867.2000000000003]
["Chappell, Dean",null,79.5,830,121,"M6",1.5,55,1425,null,"Chappell, Dean",null,436.9,337.9,1370.4,2145.1999999999998]
["Merchant, Wilson",null,82,770,68,"M6",4,55,1425,null,"Merchant, Wilson",null,500,314.5,568.9,1383.4]
["Combs, Hank",null,3.5,1260,66,"M6",3.5,25,1825,null,"Combs, Hank",null,28,503.8,541.1,1072.9000000000001]
["Longo, Dennis",null,92,1860,76,"M7",2,52,1125,null,"Longo, Dennis",null,1250.2,763,887.8,2901]
["Scharpf, Tad",null,85.5,2210,53,"M7",1.5,52,1200,null,"Scharpf, Tad",null,827.9,901,515.79999999999995,2244.6999999999998]
["Hayes, Michael",null,87,1210,46,"M7",3,52,1200,null,"Hayes, Michael",null,912.5,504.1,406.9,1823.5]
["Bucher, Don",null,80.5,660,31,"M7",2.5,52,1300,null,"Bucher, Don",null,593.4,281,183.6,1058]
["Tabas, Michael",null,5,980,42,"M7",5,25,2300,null,"Tabas, Michael",null,40,411.4,345.8,797.2]
["Holmes, Chuck",null,76.5,960,42,"M8",4.5,49,1300,null,"Holmes, Chuck",null,756.8,414.8,500.1,1671.6999999999998]
["Piercy, Carrol",null,49.5,820,34,"M8",1.5,49,2300,null,"Piercy, Carrol",null,123,334.1,351.4,808.5]
["Bryant, Errol",null,2,860,null,"M8",2,25,2300,null,"Bryant, Errol",null,16,356.7,0,372.7]
["Hosner, Jerry",null,86,1740,34,"M9",2,49,1125,null,"Hosner, Jerry",null,1758.7,1500,451.4,3710.1]
["Kunde, Bruce",null,1.5,1530,83,"M9",1.5,25,2300,null,"Kunde, Bruce",null,12,1268.2,1840.6,3120.8]
["Mccreight, Floyd",null,68,500,0,"M9",2,49,1425,null,"Mccreight, Floyd",null,879.1,294.7,0,1173.8]
["Hanna, Jack",null,3.5,680,null,"M9",3.5,25,2300,null,"Hanna, Jack",null,28,440.1,0,468.1]
["Wahl, Roger",null,0,570,0,"M9",null,null,null,null,"Wahl, Roger",null,0,349.6,0,349.6]
["Schouten, Bill",null,38,780,null,"M10",2,43,2300,null,"Schouten, Bill",null,522,760.7,0,1282.7]
["Faulkner, Elgin",null,2,550,34,"M10",2,25,2300,null,"Faulkner, Elgin",null,16,546.79999999999995,687.5,1250.3]
["Shaw, Marc",null,104,2620,124,"MM",2,55,1075,null,"Shaw, Marc",null,1039,720.2,560,2319.1999999999998]
["Kinney, Brian",null,98.5,6460,203,"OM",2.5,58,1200,null,"Kinney, Brian",null,817.8,1140.5999999999999,1207,3165.3999999999996]
["Schaffer, Dylan",null,105,7710,160,"OM",3,58,1125,null,"Schaffer, Dylan",null,979.2,1232.3,914.9,3126.4]
["Seal, Stephen",null,100,5810,190,"OM",4,58,1200,null,"Seal, Stephen",null,853.3,1089,1119.4000000000001,3061.7]
["Brooks, Steven",null,98.5,5920,182,"OM",2.5,58,1200,null,"Brooks, Steven",null,817.8,1097.9000000000001,1065.2,2980.9]
["Malak, Kevin",null,98,2210,187,"OM",2,58,1200,null,"Malak, Kevin",null,806.2,713.8,1099.0999999999999,2619.1]
["Jaquess, Regina",null,110,7460,165,"OW",2,55,1025,null,"Jaquess, Regina",null,1500,1376.4,1408.2,4284.6000000000004]
["Haw, Makayla",null,98.5,3310,163,"OW",2.5,55,1125,null,"Haw, Makayla",null,1219.5,946.3,1391.4,3557.2000000000003]
["Greenwood, Brittany",null,89,3420,144,"W1",5,55,1300,null,"Greenwood, Brittany",null,1072.5999999999999,1000.4,1402.4,3475.4]
["Runion, Haley",null,86,3730,142,"W1",2,55,1300,null,"Runion, Haley",null,1013.4,1037.8,1384.4,3435.6]
["Lindy, Alison",null,94,3810,116,"W1",4,55,1200,null,"Lindy, Alison",null,1174.0999999999999,1047.0999999999999,1144,3365.2]
["Mcclure, Kayla",null,87,3110,112,"W1",3,55,1300,null,"Mcclure, Kayla",null,1033,961.1,1105.7,3099.8]
["Waitt, Julia",null,91.5,2340,103,"W1",1.5,55,1200,null,"Waitt, Julia",null,1122.9000000000001,852.4,1018.1,2993.4]
["Guyer, Carli",null,78,3210,94,"W1",6,55,1600,null,"Guyer, Carli",null,862.4,974,928.2,2764.6000000000004]
["Backlund, Caley",null,77,1440,94,"W1",5,55,1600,null,"Backlund, Caley",null,844.2,694.5,928.2,2466.9]
["Chayer, Alyssa",null,93,1070,64,"W1",3,55,1200,null,"Chayer, Alyssa",null,1153.5,612.70000000000005,606.29999999999995,2372.5]
["Fowler, Elizabeth",null,86,1170,63,"W1",2,55,1300,null,"Fowler, Elizabeth",null,1013.4,636.20000000000005,594.70000000000005,2244.3000000000002]
["Combs, Ashley",null,74,540,84,"W1",2,55,1600,null,"Combs, Ashley",null,790.6,459.1,825.2,2074.9]
["Barringer, Jamie",null,81,3480,111,"W2",3,55,1425,null,"Barringer, Jamie",null,758.4,903.6,1052.8,2714.8]
["Harris, Betsy",null,80,3910,105,"W2",2,55,1425,null,"Harris, Betsy",null,737.8,961.6,992.9,2692.3]
["McClure, Kristin",null,93,2410,89,"W2",3,55,1200,null,"McClure, Kristin",null,1030.8,742.6,829.2,2602.6000000000004]
["Tranchita, Michelle",null,75.5,1150,81,"W2",3.5,55,1600,null,"Tranchita, Michelle",null,649.4,500.3,744.8,1894.5]
["Velander, Sara",null,59.5,610,74,"W2",5.5,52,2300,null,"Velander, Sara",null,387.3,356.6,669.1,1413]
["Baldwin, Brenda",null,98,3610,135,"W3",2,55,1125,null,"Baldwin, Brenda",null,1214.2,1007.4,1321,3542.6]
["Krueger, Lori",null,97.5,3620,127,"W3",1.5,55,1125,null,"Krueger, Lori",null,1195.4000000000001,1009.3,1247.3,3452]
["Nagle, Brandy",null,88.5,3110,94,"W3",4.5,55,1300,null,"Nagle, Brandy",null,890,909.4,928.2,2727.6000000000004]
["Krueger, Julie",null,88.5,2550,78,"W3",4.5,55,1300,null,"Krueger, Julie",null,890,793.6,761.5,2445.1]
["Koenig, Mary",null,87,2640,93,"W4",3,55,1300,null,"Koenig, Mary",null,963.1,852.1,1106.7,2921.9]
["Bergmark, Connie",null,85,2460,96,"W4",1,55,1300,null,"Bergmark, Connie",null,897.1,808,1147.8,2852.8999999999996]
["Knight, Sandy",null,86,3210,74,"W4",2,55,1300,null,"Knight, Sandy",null,929.7,987.1,843.1,2759.9]
["Lindsey, Tristina",null,87,3160,71,"W4",3,55,1300,null,"Lindsey, Tristina",null,963.1,975.5,800.9,2739.5]
["Abbott, Beverly",null,75.5,3370,77,"W4",3.5,55,1600,null,"Abbott, Beverly",null,626.5,1023.8,885.1,2535.4]
["Bryans, Kim",null,61.5,820,47,"W4",1.5,55,2300,null,"Bryans, Kim",null,342.9,353.7,456,1152.5999999999999]
["Fausold, Janie",null,86,2780,66,"W5",2,52,1200,null,"Fausold, Janie",null,1183.5999999999999,949.8,799.5,2932.8999999999996]
["Brooks, Carol",null,82,2250,60,"W5",4,52,1300,null,"Brooks, Carol",null,1002,808.2,699,2509.1999999999998]
["Gradick, Debra",null,68.5,790,44,"W5",2.5,52,1600,null,"Gradick, Debra",null,538.79999999999995,363.7,434.6,1337.1]
["Schmitt, Cheryl",null,54.5,580,41,"W5",0.5,52,2300,null,"Schmitt, Cheryl",null,255.3,287.3,385.7,928.3]
["Heinrich, Gail",null,4.5,830,43,"W5",4.5,25,1825,null,"Heinrich, Gail",null,36,377.6,418.2,831.8]
["Harrison, Leza",null,82,3040,76,"W6",4,52,1300,null,"Harrison, Leza",null,1185.8,1235.5999999999999,1271.5999999999999,3692.9999999999995]
["Edwards, Prissy",null,57.5,1890,64,"W6",3.5,52,2300,null,"Edwards, Prissy",null,374.4,809.4,949.9,2133.6999999999998]
["Cavenaugh, Brenda",null,52.5,830,33,"W6",4.5,49,2300,null,"Cavenaugh, Brenda",null,283.2,389.1,262.89999999999998,935.19999999999993]
["Prociw, Janice",null,63,1520,48,"W7",3,49,1600,null,"Prociw, Janice",null,631,776.2,734.5,2141.6999999999998]
["Piercy, Janet",null,62.5,1570,33,"W7",2.5,49,1600,null,"Piercy, Janet",null,613.29999999999995,797.6,323.89999999999998,1734.8000000000002]
["Price, Artis",null,2,570,null,"W10",2,25,2300,null,"Price, Artis",null,16,826.6,0,842.6]

{"sheet":"NatsData12","index":5,"n_rows":170,"n_cols":16,"rows_kept":170,"cut":false,"hidden":false,"merged":[]}
["Skier",null,"S","T","J","Div","Slalom result",null,null,null,"Skier",null,"S nops","T nops","J nops","NOPS"]
["Gay ,Ryan",null,62,2380,null,"B1",2,49,1600,null,"Gay ,Ryan",null,1147.4000000000001,1136.2,null,2283.6000000000004]
["Butterfield ,Zachary",null,62,1870,null,"B1",2,49,1600,null,"Butterfield ,Zachary",null,1147.4000000000001,1004,null,2151.4]
["Mccormick ,Noah",null,68,1370,null,"B1",2,49,1425,null,"Mccormick ,Noah",null,1258.4000000000001,855.9,null,2114.3000000000002]
["Roberts ,William",null,68,1270,null,"B1",2,49,1425,null,"Roberts ,William",null,1258.4000000000001,823.2,null,2081.6000000000004]
["Pound ,Trace",null,67,780,null,"B1",1,49,1425,null,"Pound ,Trace",null,1239.8,641.1,null,1880.9]
["Roberts ,Edward",null,58.5,1060,null,"B1",4.5,49,1825,null,"Roberts ,Edward",null,1082.8,750.3,null,1833.1]
["Collins ,Austin",null,50,1130,null,"B1",2,49,2300,null,"Collins ,Austin",null,926.5,775.4,null,1701.9]
["Lindaman ,Gabe",null,67,290,null,"B1",1,49,1425,null,"Lindaman ,Gabe",null,1239.8,385.9,null,1625.6999999999998]
["Stockstill ,Cade",null,62,380,null,"B1",2,49,1600,null,"Stockstill ,Cade",null,1147.4000000000001,443.3,null,1590.7]
["Weber ,Samuel",null,55,480,null,"B1",1,49,1825,null,"Weber ,Samuel",null,1018.3,499.8,null,1518.1]
["Haines, Quinn",null,92,2190,117,"B2",2,55,1200,null,"Haines, Quinn",null,1193.7,792.3,1271.4000000000001,3257.4]
["Canepa, Ryan",null,91.5,3310,95,"B2",1.5,55,1200,null,"Canepa, Ryan",null,1181.5999999999999,973.6,1062.2,3217.3999999999996]
["Montgomery, Ryan",null,90,2210,91,"B2",6,55,1300,null,"Montgomery, Ryan",null,1145.8,795.9,1022.2,2963.8999999999996]
["Goddard, Thomas",null,75.5,2080,109,"B2",3.5,55,1600,null,"Goddard, Thomas",null,826.5,772.2,1197.3,2796]
["Warner, Ryan",null,75.5,3150,74,"B2",3.5,55,1600,null,"Warner, Ryan",null,826.5,949.9,843.1,2619.5]
["Leutz, Benjamin",null,80.5,940,97,"B2",2.5,55,1425,null,"Leutz, Benjamin",null,931,519.5,1082,2532.5]
["Porter, Jordan",null,80,940,95,"B2",2,55,1425,null,"Porter, Jordan",null,920.3,519.5,1062.2,2502]
["Greene, Daniel",null,61.5,2250,97,"B2",1.5,55,2300,null,"Greene, Daniel",null,565.6,803,1082,2450.6]
["Fry, Colten",null,85.5,660,85,"B2",1.5,55,1300,null,"Fry, Colten",null,1041.5,435.5,960.7,2437.6999999999998]
["Melnar, Dylan",null,75.5,1100,83,"B2",3.5,55,1600,null,"Melnar, Dylan",null,826.5,561.9,939.9,2328.3000000000002]
["Lang, Nicholas",null,105,5210,175,"B3",3,58,1125,null,"Lang, Nicholas",null,1087.5999999999999,1034.7,1328.9,3451.2000000000003]
["Garcia, Taylor",null,106.5,4350,167,"B3",4.5,58,1125,null,"Garcia, Taylor",null,1140.8,939.5,1244.5999999999999,3324.9]
["Greenwood, Samuel",null,99,5730,163,"B3",3,58,1200,null,"Greenwood, Samuel",null,893.1,1088.7,1202.7,3184.5]
["DeVito, Christian",null,101.5,6210,146,"B3",5.5,58,1200,null,"DeVito, Christian",null,970.7,1136.5999999999999,1027,3134.3]
["Mechler, Dane",null,110,4060,135,"B3",2,58,1075,null,"Mechler, Dane",null,1272,905.5,915.6,3093.1]
["Wilson, KC",null,111,2710,103,"B3",3,58,1075,null,"Wilson, KC",null,1311.5,729.4,602.9,2643.8]
["Guyer, Corbin",null,96.5,3560,141,"B3",0.5,58,1200,null,"Guyer, Corbin",null,820.1,844,976.1,2640.2]
["Kachele, Zachary",null,96.5,2600,145,"B3",0.5,58,1200,null,"Kachele, Zachary",null,820.1,713.4,1016.8,2550.3000000000002]
["Voisard, James",null,93.5,4820,124,"B3",3.5,58,1300,null,"Voisard, James",null,738.5,992.5,806,2537]
["Kulig, Paul",null,101,1970,132,"B3",5,58,1200,null,"Kulig, Paul",null,954.8,615,885.5,2455.3000000000002]
["Baldwin, Kristen",null,74,3300,null,"G1",2,49,1300,null,"Baldwin, Kristen",null,1401,1235.5,null,2636.5]
["Parker, Caroline",null,57,1540,null,"G1",3,49,1825,null,"Parker, Caroline",null,1118.8,908.8,null,2027.6]
["Hansen, Kennedy",null,56,1410,null,"G1",2,49,1825,null,"Hansen, Kennedy",null,1102.0999999999999,877.1,null,1979.1999999999998]
["Grathwohl, Allyson",null,38,2720,null,"G1",2,43,2300,null,"grathwohl, Allyson",null,799.7,1142.9000000000001,null,1942.6000000000001]
["Babiash, Kristen",null,61,760,null,"G1",1,49,1600,null,"Babiash, Kristen",null,1185.4000000000001,683.7,null,1869.1000000000001]
["Baldwin, Brooke",null,85.5,6290,95,"G2",1.5,52,1200,null,"Baldwin, Brooke",null,1279.0999999999999,1447.3,1233.7,3960.1]
["Butterfield, Krista",null,82.5,5780,60,"G2",4.5,52,1300,null,"Butterfield, Krista",null,1264.9000000000001,1219.0999999999999,926.6,3410.6]
["Gay, Anna",null,85,4360,69,"G2",1,52,1200,null,"Gay, Anna",null,1195.3,1391.1,809.6,3396]
["Morgan, Emma",null,79,3980,69,"G2",1,52,1300,null,"Morgan, Emma",null,1101.0999999999999,1168.2,926.6,3195.9]
["Grathwohl, Bailey",null,73,3390,69,"G2",1,52,1425,null,"Grathwohl, Bailey",null,948,1083.7,926.6,2958.3]
["Grathwohl, Taylor",null,79,2450,68,"G2",1,52,1300,null,"Grathwohl, Taylor",null,1101.0999999999999,930.9,913.9,2945.9]
["Stackpole, Samantha",null,79,1620,68,"G2",1,52,1300,null,"Stackpole, Samantha",null,1101.0999999999999,767.1,913.9,2782.1]
["Horton, Katie",null,71,3000,52,"G2",5,52,1600,null,"Horton, Katie",null,899.4,1023.5,699,2621.9]
["Montgomery, Ashley",null,75.5,2340,49,"G2",3.5,52,1425,null,"Montgomery, Ashley",null,1010.5,911.1,655.6,2577.1999999999998]
["Roberts, Nellie",null,73.5,2010,51,"G2",1.5,52,1425,null,"Roberts, Nellie",null,960.4,848.5,684.7,2493.6]
["Lang, Erika",null,95.5,9140,119,"G3",5.5,55,1200,null,"Lang, Erika",null,1249.2,1573.7,1124.9000000000001,3947.8]
["MacIntyre, Kara",null,98,5380,105,"G3",2,55,1125,null,"MacIntyre, Kara",null,1384.2,1159.7,972.1,3516]
["Horton, Ellie",null,91.5,4840,112,"G3",1.5,55,1200,null,"Horton, Ellie",null,1054.5999999999999,1091.0999999999999,1048.7,3194.4]
["Morris, Jaye",null,90.5,2990,121,"G3",0.5,55,1200,null,"Morris, Jaye",null,1009.9,826.8,1146.5999999999999,2983.3]
["Grathwohl, Abbi",null,91.5,3790,102,"G3",1.5,55,1200,null,"Grathwohl, Abbi",null,1054.5999999999999,947.8,939.1,2941.5]
["Morgan, Jenna",null,91,3720,101,"G3",1,55,1200,null,"Morgan, Jenna",null,1032.0999999999999,937.7,928.1,2897.9]
["Waitt, Julia",null,92.5,2420,96,"G3",2.5,55,1200,null,"Waitt, Julia",null,1100.9000000000001,732,872.9,2705.8]
["Daulton, Riley",null,82,2090,111,"G3",4,55,1425,null,"Daulton, Riley",null,686.5,672.7,1037.8,2397]
["Schneider, Madison",null,80,1430,95,"G3",2,55,1425,null,"Schneider, Madison",null,624,540.6,861.8,2026.4]
["Nicholson, Allie",null,87.5,660,70,"G3",3.5,55,1300,null,"Nicholson, Allie",null,884.5,346.3,580.4,1811.2]
["Schaffer, Dylan",null,104,8450,159,"M1",2,58,1125,null,"Schaffer, Dylan",null,982.4,1339.9,1091.8,3414.1]
["Stevenson, Michael",null,104,5270,168,"M1",2,58,1125,null,"Stevenson, Michael",null,982.4,1099.9000000000001,1165.7,3248]
["Van Treese, Benjamin",null,98,2540,121,"M1",2,58,1200,null,"Van Treese, Benjamin",null,816.4,975,1050.7,2842.1]
["Cole, Randall",null,106,3950,154,"M1",4,58,1125,null,"Cole, Randall",null,1042.7,810.7,777.4,2630.8]
["Curmi, Aaron",null,97,4150,128,"M1",1,58,1200,null,"Curmi, Aaron",null,790.9,995.4,835.7,2622]
["Hinkle, Ryan",null,97.5,1770,145,"M1",1.5,58,1200,null,"Hinkle, Ryan",null,803.6,697.1,976.5,2477.1999999999998]
["Shipanock, Adam",null,98.5,1900,127,"M1",2.5,58,1200,null,"Shipanock, Adam",null,829.4,718.1,827.4,2374.9]
["Brooks, Ryan",null,98,1770,128,"M1",2,58,1200,null,"Brooks, Ryan",null,816.4,697.1,835.7,2349.1999999999998]
["Larson, Erik",null,93,2670,140,"M1",3,58,1300,null,"Larson, Erik",null,694.4,664.8,517.1,1876.3]
["Zimmerman, Kyle",null,2.5,1580,90,"M1",2.5,25,1825,null,"Zimmerman, Kyle",null,20,827.8,935.2,1783]
["Barringer, Treece",null,99,3860,179,"M2",3,58,1200,null,"Barringer, Treece",null,790,900.7,1171.0999999999999,2861.8]
["Kodiak, Cris",null,81.5,2110,122,"M2",3.5,58,1600,null,"Kodiak, Cris",null,441.9,685.1,681.3,1808.3]
["Klingbeil, Kevin",null,86,1480,125,"M2",2,58,1425,null,"Klingbeil, Kevin",null,517.6,583.4,706.5,1807.5]
["Legg, Brian",null,98.5,1190,95,"M2",2.5,58,1200,null,"Legg, Brian",null,777.9,528.6,459.3,1765.8]
["Lemley, Dan",null,68,1020,120,"M2",2,58,2300,null,"Lemley, Dan",null,264.5,492.9,664.6,1422]
["Burnash, Kyle",null,3.5,740,52,"M2",3.5,25,1825,null,"Burnash, Kyle",null,28,426.2,128,582.20000000000005]
["Surdej, Jeff",null,103,3760,174,"M3",1,55,1075,null,"Surdej, Jeff",null,1029.9000000000001,870.1,1215.7,3115.7]
["Hooten, Jody",null,93,3060,172,"M3",3,55,1200,null,"Hooten, Jody",null,631,790.3,1192.7,2614]
["Whetsel, Kirby",null,93.5,2300,164,"M3",3.5,55,1200,null,"Whetsel, Kirby",null,647.20000000000005,691.6,1102.0999999999999,2440.9]
["Eller, Christophe",null,96,1800,161,"M3",6,55,1200,null,"Eller, Christophe",null,733.8,616.79999999999995,1068.5999999999999,2419.1999999999998]
["Bellefeuille, Scott",null,99,3150,132,"M3",3,55,1125,null,"Bellefeuille, Scott",null,850.5,801,759.9,2411.4]
["Fisher, Forest",null,95,5980,91,"M3",5,55,1200,null,"Fisher, Forest",null,698.1,1080.5999999999999,377.5,2156.1999999999998]
["Milhorn, Michael",null,89,2940,123,"M3",5,55,1300,null,"Milhorn, Michael",null,513.29999999999995,775.6,670.1,1959]
["Piercy, Cory",null,80.5,1650,143,"M3",2.5,55,1425,null,"Piercy, Cory",null,325.2,592.20000000000005,873.7,1791.1]
["Wenzel, Norman",null,88.5,320,139,"M3",4.5,55,1300,null,"Wenzel, Norman",null,500,275.3,831.8,1607.1]
["Ripley, Ryan",null,80,2120,81,"M3",2,55,1425,null,"Ripley, Ryan",null,316.39999999999998,665.8,296,1278.2]
["Knight, Tony",null,100,4890,141,"M4",4,55,1125,null,"Knight, Tony",null,898,991.7,1054.3,2944]
["Goodman, Terry",null,95.5,1500,160,"M4",5.5,55,1200,null,"Goodman, Terry",null,718.4,519.6,1273.5,2511.5]
["Newman, Thomas",null,92.5,2570,153,"M4",2.5,55,1200,null,"Newman, Thomas",null,616.4,697.5,1191.9000000000001,2505.8000000000002]
["Haines, Hutch",null,98,1320,154,"M4",2,55,1125,null,"Haines, Hutch",null,814,484.5,1203.5,2502]
["Young, Barry",null,100,2370,128,"M4",4,55,1125,null,"Young, Barry",null,898,667.3,908.9,2474.1999999999998]
["Grau, Mitch",null,92.5,2200,149,"M4",2.5,55,1200,null,"Grau, Mitch",null,616.4,640.70000000000005,1145.7,2402.8000000000002]
["Webb, Greg",null,93,2240,133,"M4",3,55,1200,null,"Webb, Greg",null,632.5,647,964.4,2243.9]
["Estes, Robbie",null,94.5,2270,125,"M4",4.5,55,1200,null,"Estes, Robbie",null,682.9,651.70000000000005,876,2210.6]
["Kokernak, David",null,94,1670,122,"M4",4,55,1200,null,"Kokernak, David",null,665.7,551,843.2,2059.9]
["Lindsey, Jeff",null,95.5,1730,116,"M4",5.5,55,1200,null,"Lindsey, Jeff",null,718.4,561.70000000000005,778.5,2058.6]
["Miller, Stephen",null,92.5,2790,131,"M5",2.5,55,1200,null,"Miller, Stephen",null,675.2,894.9,1220.5999999999999,2790.7]
["Johnson, Dee",null,92,2500,129,"M5",2,55,1200,null,"Johnson, Dee",null,658.9,823,1194.4000000000001,2676.3]
["Vosburgh, George",null,92,3060,107,"M5",2,55,1200,null,"Vosburgh, George",null,658.9,960.3,912,2531.1999999999998]
["Holm, Brian",null,95,970,142,"M5",5,55,1200,null,"Holm, Brian",null,762.1,399.7,1366,2527.8000000000002]
["Mcclure, James",null,89,2110,110,"M5",5,55,1300,null,"Mcclure, James",null,567.6,723.1,949.9,2240.6]
["Able, John",null,91,1890,91,"M5",1,55,1200,null,"Able, John",null,627.20000000000005,664.9,713.9,2006]
["Archambeau, Robert",null,92,710,115,"M5",2,55,1200,null,"Archambeau, Robert",null,658.9,315,1013.5,1987.4]
["Lee, Eric",null,88,3930,43,"M5",4,55,1300,null,"Lee, Eric",null,539.70000000000005,1162.3,173.6,1875.6]
["Fitzpatrick, Jay",null,94.5,1020,80,"M5",4.5,55,1200,null,"Fitzpatrick, Jay",null,744,415.3,582,1741.3]
["Luzoro, Joe",null,5,1530,120,"M5",5,25,1825,null,"Luzoro, Joe",null,40,565.9,1077.5999999999999,1683.5]
["Dees, Frankie",null,92.5,2750,138,"M6",2.5,55,1200,null,"Dees, Frankie",null,891.7,1050.3,2036.5,3978.5]
["Chappell, Dean",null,86.5,1350,117,"M6",2.5,55,1300,null,"Chappell, Dean",null,672.8,518.9,1544.6,2736.3]
["Merchant, Wilson",null,91.25,1670,58,"M6",1.25,55,1200,null,"Merchant, Wilson",null,841.9,640.70000000000005,422.9,1905.5]
["Hayes, Michael",null,89,1210,44,"M6",5,55,1300,null,"Hayes, Michael",null,757.9,465.6,230,1453.5]
["Combs, Hank",null,64,1230,79,"M6",4,55,2300,null,"Combs, Hank",null,206.8,473.2,771.7,1451.7]
["Fisher, Lance",null,98,260,36,"M6",2,55,1125,null,"Fisher, Lance",null,1139.5999999999999,101.4,137.5,1378.5]
["White, Thomas",null,57.5,890,69,"M6",3.5,52,2300,null,"White, Thomas",null,144.6,343.4,597.6,1085.5999999999999]
["Sandner, James",null,3.5,1230,51,"M6",3.5,25,1825,null,"Sandner, James",null,28,473.2,322,823.2]
["Bucher, Don",null,61.5,890,39,"M6",1.5,55,2300,null,"Bucher, Don",null,180.1,343.4,170.5,694]
["Cooper, William",null,1.5,1000,44,"M6",1.5,25,1825,null,"Cooper, William",null,12,385.4,230,627.4]
["Longo, Dennis",null,91.5,2100,73,"M7",1.5,52,1125,null,"Longo, Dennis",null,1174.7,892.2,838.3,2905.2]
["Scharpf, Tad",null,86,2410,58,"M7",2,52,1200,null,"Scharpf, Tad",null,788,1009.4,595,2392.4]
["Sharkey, Randy",null,80,1680,50,"M7",2,52,1300,null,"Sharkey, Randy",null,500,730.5,468.8,1699.3]
["Sager, Dow",null,70,1030,68,"M7",4,52,1600,null,"Sager, Dow",null,228.5,471.3,756.3,1456.1]
["Hosner, Jerry",null,84.5,2170,36,"M8",0.5,49,1125,null,"Hosner, Jerry",null,1216.7,1313,388.4,2918.1]
["Piercy, Carrol",null,76,1990,51,"M8",4,49,1300,null,"Piercy, Carrol",null,733.7,1194,669.6,2597.3000000000002]
["Holmes, Chuck",null,80,1240,40,"M8",2,49,1200,null,"Holmes, Chuck",null,936,710.7,462.7,2109.4]
["Reid, Glen",null,73.5,980,0,"M8",1.5,49,1300,null,"Reid, Glen",null,627,549,0,1176]
["Bryant, Errol",null,2.5,1010,null,"M8",2.5,25,2300,null,"Bryant, Errol",null,20,567.4,0,587.4]
["Kunde, Bruce",null,67.5,1230,88,"M9",1.5,49,1425,null,"Kunde, Bruce",null,980.1,986.9,1999.7,3966.7]
["Wahl, Roger",null,60.5,580,null,"M9",0.5,49,1600,null,"Wahl, Roger",null,765.9,398.3,0,1164.2]
["Hanna, Jack",null,5,1300,null,"M9",5,25,2300,null,"Hanna, Jack",null,40,1055.0999999999999,0,1095.0999999999999]
["Schouten, Bill",null,44.5,730,null,"MA",2.5,46,2300,null,"Schouten, Bill",null,606.4,714.6,0,1321]
["Price, Harry",null,2.5,890,0,"MA",2.5,25,2300,null,"Price, Harry",null,20,861.7,0,881.7]
["Faulkner, Elgin",null,3.5,520,0,"MA",3.5,25,2300,null,"Faulkner, Elgin",null,28,518.6,0,546.6]
["Shaw, Marc",null,106.5,6700,184,"MM",4.5,55,1075,null,"Shaw, Marc",null,1201.2,1134.5999999999999,1180.4000000000001,3516.2]
["Seal, Stephen",null,94.5,5920,183,"OM",4.5,58,1300,null,"Seal, Stephen",null,677.5,1081.5999999999999,1052.7,2811.8]
["Malak, Kevin",null,103,4960,165,"OM",1,58,1125,null,"Malak, Kevin",null,883.6,997.3,926,2806.9]
["Bennett, Danyelle",null,98,7500,148,"OW",2,55,1125,null,"Bennett, Danyelle",null,1185,1378.5,1268,3831.5]
["Todd-strickl, Joy",null,92.5,7580,153,"OW",2.5,55,1200,null,"Todd-strickl, Joy",null,1048.5,1385.4,1310.0999999999999,3744]
["Morgan, Lauren",null,93,4620,160,"OW",3,55,1200,null,"Morgan, Lauren",null,1060.5,1099.9000000000001,1368.5,3528.9]
["Haw, Makayla",null,99,4030,137,"OW",3,55,1125,null,"Haw, Makayla",null,1210.8,1032.0999999999999,1174.0999999999999,3417]
["Mcclure, Keri",null,99,3470,118,"W1",3,55,1125,null,"Mcclure, Keri",null,1261.5999999999999,975.7,1163,3400.3]
["Lindy, Alison",null,98,2880,114,"W1",2,55,1125,null,"Lindy, Alison",null,1238.8,896.3,1124.9000000000001,3260]
["Mcclure, Kayla",null,80.5,3050,113,"W1",2.5,55,1425,null,"Mcclure, Kayla",null,870.1,920,1115.3,2905.4]
["Chayer, Alyssa",null,92,1220,68,"W1",2,55,1200,null,"Chayer, Alyssa",null,1105.8,606.4,651.70000000000005,2363.9]
["Madden, Christine",null,65,2640,78,"W1",5,55,2300,null,"Madden, Christine",null,593.79999999999995,861.6,761.5,2216.9]
["Ruehl, Samantha",null,1.5,3910,48,"W1",1.5,25,1825,null,"Ruehl, Samantha",null,12,1030.0999999999999,412.6,1454.7]
["Kalkbrenner, Erin",null,86.5,2880,128,"W2",2.5,55,1300,null,"Kalkbrenner, Erin",null,888.8,745.7,1218.5,2853]
["Harris, Betsy",null,81,3910,106,"W2",3,55,1425,null,"Harris, Betsy",null,768.9,899.7,1002.9,2671.5]
["Barringer, Jamie",null,81,3190,110,"W2",3,55,1425,null,"Barringer, Jamie",null,768.9,794,1042.8,2605.6999999999998]
["Lemley, Sara",null,81,3970,92,"W2",3,55,1425,null,"Lemley, Sara",null,768.9,908.1,860.4,2537.4]
["Tranchita, Michelle",null,82.5,930,69,"W2",4.5,55,1425,null,"Tranchita, Michelle",null,800.6,372.5,613.9,1787]
["Baldwin, Brenda",null,98,4530,136,"W3",2,55,1125,null,"Baldwin, Brenda",null,1245.5,1204.5,1330.1,3780.1]
["Krueger, Lori",null,94.5,3020,113,"W3",4.5,55,1200,null,"Krueger, Lori",null,1129.4000000000001,936.4,1115.3,3181.1]
["Nagle, Brandy",null,91.5,4360,98,"W3",1.5,55,1200,null,"Nagle, Brandy",null,1035.7,1176.2,968.4,3180.3]
["Krueger, Julie",null,86,2550,75,"W3",2,55,1300,null,"Krueger, Julie",null,877.4,843,729.1,2449.5]
["Johnson, Laura",null,77,1840,50,"W3",5,55,1600,null,"Johnson, Laura",null,654.1,688.3,438.1,1780.5]
["Bergmark, Connie",null,86,2290,93,"W4",2,55,1300,null,"Bergmark, Connie",null,929.7,792.9,1106.7,2829.3]
["Koenig, Mary",null,86,2400,91,"W4",2,55,1300,null,"Koenig, Mary",null,929.7,819.8,1079.2,2828.7]
["Abbott, Beverly",null,79,3400,75,"W4",1,55,1425,null,"Abbott, Beverly",null,718.2,1050.9000000000001,857.1,2626.2]
["Knight, Sandy",null,85.5,2800,64,"W4",1.5,55,1300,null,"Knight, Sandy",null,913.3,915.1,701.8,2530.1999999999998]
["Lindsey, Tristina",null,86,2690,60,"W4",2,55,1300,null,"Lindsey, Tristina",null,929.7,889.3,644.70000000000005,2463.6999999999998]
["Brooks, Carol",null,87.25,2160,51,"W4",3.25,55,1300,null,"Brooks, Carol",null,971.6,760.5,514.6,2246.6999999999998]
["Olson, Diana",null,59.25,1830,88,"W4",5.25,52,2300,null,"Olson, Diana",null,308.5,675.7,1037.9000000000001,2022.1]
["McCollum, Shelley",null,63.5,580,34,"W4",3.5,55,2300,null,"McCollum, Shelley",null,375.9,297.8,260.7,934.4]
["Fausold, Janie",null,86,2780,71,"W5",2,52,1200,null,"Fausold, Janie",null,1155.0999999999999,924.5,883.7,2963.3]
["Madden, Janet",null,74,1440,61,"W5",2,52,1425,null,"Madden, Janet",null,649.9,543.4,715.7,1909]
["Bennett, Anne",null,67.5,3440,34,"W5",1.5,52,1600,null,"Bennett, Anne",null,460.9,1098.2,273,1832.1]
["Gradick, Debra",null,69.5,700,37,"W5",3.5,52,1600,null,"Gradick, Debra",null,513.6,303.39999999999998,321.10000000000002,1138.0999999999999]
["Schmitt, Cheryl",null,53,580,0,"W5",5,49,2300,null,"Schmitt, Cheryl",null,198.6,260.60000000000002,0,459.2]
["Harrison, Leza",null,86,3380,87,"W6",2,52,1200,null,"Harrison, Leza",null,1734.8,1357.9,1588.3,4681]
["Edwards, Prissy",null,57.5,1360,61,"W6",3.5,52,2300,null,"Edwards, Prissy",null,433.6,603.9,873.7,1911.2]
["Cavenaugh, Brenda",null,58,1390,30,"W6",4,52,2300,null,"Cavenaugh, Brenda",null,446.2,615.79999999999995,210.8,1272.8]
["Prociw, Janice",null,67,1600,31,"W7",1,49,1425,null,"Prociw, Janice",null,864.9,810.4,279.10000000000002,1954.4]
["Fischer, Pat",null,5,840,null,"W8",5,25,2300,null,"Fischer, Pat",null,40,592.70000000000005,0,632.70000000000005]
["Morris, Loretta",null,2,160,null,"W9",2,25,2300,null,"Morris, Loretta",null,16,177.1,0,193.1]
["Price, Artis",null,1,660,null,"WA",1,25,2300,null,"Price, Artis",null,8,927.2,0,935.2]

{"sheet":"NatsData11","index":6,"n_rows":178,"n_cols":16,"rows_kept":178,"cut":false,"hidden":false,"merged":[]}
["Skier",null,"S","T","J","Div","Slalom result",null,null,null,"Skier",null,"S nops","T nops","J nops","NOPS"]
["Warner, Ryan",null,74,2480,null,"B1",2,49,1300,null,"Warner, Ryan",null,1383.2,1232.3,0,2615.5]
["Butterfield, Zachary",null,56,1350,null,"B1",2,49,1825,null,"Butterfield, Zachary",null,1078.2,970.3,0,2048.5]
["Keller, Blake",null,62.5,570,null,"B1",2.5,49,1600,null,"Keller, Blake",null,1189.2,691.4,0,1880.6]
["Stange, Griffin",null,49.5,820,null,"B1",1.5,49,2300,null,"Stange, Griffin",null,966,797.7,0,1763.7]
["Roberts, Edward",null,46.5,820,null,"B1",4.5,46,2300,null,"Roberts, Edward",null,913.7,797.7,0,1711.4]
["Gay, Ryan",null,40.5,1120,null,"B1",4.5,43,2300,null,"Gay, Ryan",null,808.3,901.6,0,1709.9]
["Collins, Austin",null,48,700,null,"B1",6,46,2300,null,"Collins, Austin",null,939.9,749.6,0,1689.5]
["Mccormick, Noah",null,45,760,null,"B1",3,46,2300,null,"Mccormick, Noah",null,887.5,774.2,0,1661.7]
["Cirilli, Rocco",null,52,290,null,"B1",4,49,2300,null,"Cirilli, Rocco",null,1009.3,530.20000000000005,0,1539.5]
["Roberts, William",null,50,290,null,"B1",2,49,2300,null,"Roberts, William",null,974.6,530.20000000000005,0,1504.8]
["Garcia, Taylor",null,96.5,4280,142,"B2",0.5,55,1125,null,"Garcia, Taylor",null,1310.0999999999999,1156.5,1634.4,4101]
["Lang, Nicholas",null,95.5,5340,127,"B2",5.5,55,1200,null,"Lang, Nicholas",null,1285.7,1271.0999999999999,1450.8,4007.6]
["Guyer, Corbin",null,87,3580,119,"B2",3,55,1300,null,"Guyer, Corbin",null,1086.3,1071.5999999999999,1352,3509.9]
["MacIntyre, Zachary",null,82,4650,84,"B2",4,55,1425,null,"MacIntyre, Zachary",null,976.2,1198.2,910.2,3084.6]
["Montavon, William",null,87,5610,55,"B2",3,55,1300,null,"Montavon, William",null,1086.3,1298.0999999999999,527.4,2911.8]
["Canepa, Ryan",null,79.5,2580,86,"B2",1.5,55,1425,null,"Canepa, Ryan",null,923.1,931.7,936,2790.8]
["Porter, Jordan",null,77.25,1140,98,"B2",5.25,55,1600,null,"Porter, Jordan",null,876.5,657.4,1089,2622.9]
["Carl, Andrew",null,84.5,2100,65,"B2",0.5,55,1300,null,"Carl, Andrew",null,1030.5999999999999,853.3,661.8,2545.6999999999998]
["Parker, Cullen",null,79.5,1530,79,"B2",1.5,55,1425,null,"Parker, Cullen",null,923.1,745.4,845.6,2514.1]
["Bridgford, Ryan",null,82,1870,66,"B2",4,55,1425,null,"Bridgford, Ryan",null,976.2,812.1,675,2463.3000000000002]
["Brooks, Steven",null,99,5840,153,"B3",3,58,1200,null,"Brooks, Steven",null,909.5,1130.3,1168.0999999999999,3207.9]
["Greenwood, Samuel",null,98.5,3810,154,"B3",2.5,58,1200,null,"Greenwood, Samuel",null,894.8,917.6,1176.9000000000001,2989.3]
["Peterson, Dustin",null,88.5,4250,149,"B3",4.5,58,1425,null,"Peterson, Dustin",null,635.5,967.9,1132.8,2736.2]
["Mechler, Mason",null,91.5,4830,120,"B3",1.5,58,1300,null,"Mechler, Mason",null,706.5,1030.2,874.6,2611.3000000000002]
["DeVito, Christian",null,93,5120,110,"B3",3,58,1300,null,"DeVito, Christian",null,744.1,1060,784.5,2588.6]
["Mechler, Dane",null,94.5,3280,128,"B3",4.5,58,1300,null,"Mechler, Dane",null,783.2,852.9,946.3,2582.4]
["Newton, Nick",null,93.5,2830,117,"B3",3.5,58,1300,null,"Newton, Nick",null,757,793.7,847.7,2398.4]
["Evatt, Hank",null,93,2180,126,"B3",3,58,1300,null,"Evatt, Hank",null,744.1,698.8,928.4,2371.3000000000002]
["Detty, Briant",null,91.5,1680,132,"B3",1.5,58,1300,null,"Detty, Briant",null,706.5,615.29999999999995,982,2303.8000000000002]
["McCormick, Cole",null,93.5,4540,84,"B3",3.5,58,1300,null,"McCormick, Cole",null,757,999.6,546.70000000000005,2303.3000000000002]
["Ross, Neilly",null,67.5,5320,null,"G1",1.5,49,1425,null,"Ross, Neilly",null,1348.4,1628.8,0,2977.2]
["Baldwin, Kristen",null,69,3670,null,"G1",3,49,1425,null,"Baldwin, Kristen",null,1368.2,1386.4,0,2754.6]
["Grathwohl, Bailey",null,52,2450,null,"G1",4,49,2300,null,"Grathwohl, Bailey",null,1135.9000000000001,1163.4000000000001,0,2299.3000000000002]
["Morgan, Mia",null,31.5,2780,null,"G1",1.5,40,2300,null,"Morgan, Mia",null,821.4,1229,0,2050.4]
["Montgomery, Ashley",null,69,660,null,"G1",3,49,1425,null,"Montgomery, Ashley",null,1368.2,658.4,0,2026.6]
["Kosek, Tianna",null,65,510,null,"G1",5,49,1600,null,"Kosek, Tianna",null,1315.2,588.70000000000005,0,1903.9]
["Parker, Caroline",null,44,920,null,"G1",2,46,2300,null,"Parker, Caroline",null,1018.8,760.5,0,1779.3]
["Newman, Charlsey",null,43.5,660,null,"G1",1.5,46,2300,null,"Newman, Charlsey",null,1011.3,658.4,0,1669.7]
["Stange, Parker",null,47,500,null,"G1",5,46,2300,null,"Stange, Parker",null,1063.4000000000001,583.70000000000005,0,1647.1]
["Grathwohl, Allyson",null,14,1660,null,"G1",2,31,2300,null,"Grathwohl, Allyson",null,488.6,982.6,0,1471.2]
["Warner, Kat",null,85,2570,93,"G2",1,52,1200,null,"Warner, Kat",null,1245.5999999999999,952,1203.5999999999999,3401.2]
["Baldwin, Brooke",null,79,5210,72,"G2",1,52,1300,null,"Baldwin, Brooke",null,1070.8,1325.1,951.3,3347.2]
["Grathwohl, Abbi",null,86,2580,82,"G2",2,52,1200,null,"Grathwohl, Abbi",null,1276.0999999999999,953.7,1074.4000000000001,3304.2]
["Boskus, Julianna",null,80.5,4110,73,"G2",2.5,52,1300,null,"Boskus, Julianna",null,1113.2,1185.9000000000001,963.9,3263]
["Gay, Anna",null,76.5,5750,60,"G2",4.5,52,1425,null,"Gay, Anna",null,1002.1,1387.7,794.7,3184.5]
["Butterfield, Krista",null,79.5,3940,63,"G2",1.5,52,1300,null,"Butterfield, Krista",null,1084.9000000000001,1162.7,834.9,3082.5]
["Nicholson, Allie",null,87.5,730,61,"G2",3.5,52,1200,null,"Nicholson, Allie",null,1322.5,528.20000000000005,808.2,2658.9]
["Morgan, Emma",null,67,2660,55,"G2",1,52,1600,null,"Morgan, Emma",null,762.6,967.4,725.7,2455.6999999999998]
["Grathwohl, Taylor",null,66.5,2750,41,"G2",0.5,52,1600,null,"Grathwohl, Taylor",null,750.9,982.6,516.29999999999995,2249.8000000000002]
["Horton, Katie",null,69,1750,45,"G2",3,52,1600,null,"Horton, Katie",null,810.1,795.3,579.1,2184.5]
["Lang, Erika",null,91.5,8990,109,"G3",1.5,55,1200,null,"Lang, Erika",null,1117,1628.7,1070.0999999999999,3815.8]
["Haw, Makayla",null,93,3820,137,"G3",3,55,1200,null,"Haw, Makayla",null,1178.8,1017.2,1359.4,3555.4]
["MacIntyre, Kara",null,92,4900,91,"G3",2,55,1200,null,"MacIntyre, Kara",null,1137.3,1166.5,876.9,3180.7]
["Guyer, Carli",null,87,3970,106,"G3",3,55,1300,null,"Guyer, Carli",null,945.6,1039,1038.4000000000001,3023]
["Morris, Jaye",null,85,2580,115,"G3",1,55,1300,null,"Morris, Jaye",null,876,819.7,1133.2,2828.9]
["Waitt, Julia",null,86,2420,92,"G3",2,55,1300,null,"Waitt, Julia",null,910.3,791.4,887.8,2589.5]
["Morgan, Jenna",null,76,3840,88,"G3",4,55,1600,null,"Morgan, Jenna",null,608.1,1020.2,844,2472.3000000000002]
["Daulton, Riley",null,82.5,1820,98,"G3",4.5,55,1425,null,"Daulton, Riley",null,794.3,676.6,952.8,2423.6999999999998]
["Horton, Ellie",null,62.5,4560,99,"G3",2.5,55,2300,null,"Horton, Ellie",null,328.3,1121.3,963.6,2413.1999999999998]
["Schneider, Madison",null,80,1560,87,"G3",2,55,1425,null,"Schneider, Madison",null,718.3,621.6,833,2172.9]
["Seal, Stephen",null,101.5,5810,180,"M1",5.5,58,1200,null,"Seal, Stephen",null,925.7,1124.5,1254.9000000000001,3305.1]
["Stevenson, Michael",null,100.5,5750,170,"M1",4.5,58,1200,null,"Stevenson, Michael",null,898.4,1119.3,1161.8,3179.5]
["Wintter, Skip",null,96.5,5830,159,"M1",0.5,58,1200,null,"Wintter, Skip",null,795.2,1126.2,1060.3,2981.7]
["Schaffer, Dylan",null,99,5460,152,"M1",3,58,1200,null,"Schaffer, Dylan",null,858.7,1093.7,996.2,2948.6]
["Van Treese, Benjamin",null,89,3120,153,"M1",5,58,1425,null,"Van Treese, Benjamin",null,624.79999999999995,851.6,1005.3,2481.6999999999998]
["Paulovich, Jonathan",null,91.5,1550,168,"M1",1.5,58,1300,null,"Paulovich, Jonathan",null,678.4,622.9,1143.3,2444.6]
["Cole, Randall",null,102.5,1660,133,"M1",0.5,58,1125,null,"Cole, Randall",null,953.4,642.29999999999995,824.3,2420]
["Karber, Garrett",null,91.5,2580,139,"M1",1.5,58,1300,null,"Karber, Garrett",null,678.4,782.3,878.2,2338.9]
["Shipanock, Adam",null,93.5,1860,133,"M1",3.5,58,1300,null,"Shipanock, Adam",null,723.5,675.8,824.3,2223.6]
["Zimmerman, Kyle",null,95,1620,120,"M1",5,58,1300,null,"Zimmerman, Kyle",null,758.8,635.29999999999995,708.6,2102.6999999999998]
["Burris, John",null,97,5570,197,"M2",1,58,1200,null,"Burris, John",null,779.1,1057.0999999999999,1325.4,3161.6]
["Kalkbrenner, Cole",null,94,2940,167,"M2",4,58,1300,null,"Kalkbrenner, Cole",null,711.9,787.4,1055.2,2554.5]
["Eller, Christophe",null,99,1730,161,"M2",3,58,1200,null,"Eller, Christophe",null,826.3,616.6,1002.1,2445]
["Klingbeil, Kevin",null,94,1780,125,"M2",4,58,1300,null,"Klingbeil, Kevin",null,711.9,624.79999999999995,690.7,2027.4]
["Tranchita, James",null,94.5,960,140,"M2",4.5,58,1300,null,"Tranchita, James",null,722.8,470,818.8,2011.6]
["Weeks, Aaron",null,81,1810,133,"M2",3,58,1600,null,"Weeks, Aaron",null,467.1,629.6,758.7,1855.4]
["Kodiak, Cris",null,81,1160,122,"M2",3,58,1600,null,"Kodiak, Cris",null,467.1,512.79999999999995,665.4,1645.3]
["Ithomitis, Nick",null,95,200,124,"M2",5,58,1300,null,"Ithomitis, Nick",null,733.8,228.1,682.3,1644.2]
["Withrow, Kevin",null,92.5,3180,149,"M3",2.5,55,1200,null,"Withrow, Kevin",null,628.29999999999995,804.6,1082,2514.9]
["Knight, Tony",null,92.5,3720,140,"M3",2.5,55,1200,null,"Knight, Tony",null,628.29999999999995,865.7,954.8,2448.8000000000002]
["Roeder, John",null,89,970,137,"M3",5,55,1300,null,"Roeder, John",null,526.4,462.1,913.8,1902.3]
["Whetsel, Kirby",null,85.5,1950,119,"M3",1.5,55,1300,null,"Whetsel, Kirby",null,439.1,640.29999999999995,682.7,1762.1]
["Friese, Mark",null,86,1730,108,"M3",2,55,1300,null,"Friese, Mark",null,450.7,605.5,554.79999999999995,1611]
["Hatch, Eric",null,80,1600,92,"M3",2,55,1425,null,"Hatch, Eric",null,327.7,583.79999999999995,387.8,1299.3]
["Kodiak, Chad",null,74,1440,78,"M3",2,55,1600,null,"Kodiak, Chad",null,236.4,555.79999999999995,261.5,1053.7]
["Cawthern, James",null,1.5,570,58,"M3",1.5,25,2300,null,"Cawthern, James",null,12,360.5,117,489.5]
["Newman, Thomas",null,93.5,2370,149,"M4",3.5,55,1200,null,"Newman, Thomas",null,662.1,706.9,1256.5999999999999,2625.6]
["Grau, Mitch",null,92.5,2290,148,"M4",2.5,55,1200,null,"Grau, Mitch",null,629.70000000000005,694.7,1244.5999999999999,2569]
["Young, Barry",null,98.5,2870,121,"M4",2.5,55,1125,null,"Young, Barry",null,846.3,779.1,927.9,2553.3000000000002]
["Haines, Hutch",null,98.5,830,146,"M4",2.5,55,1125,null,"Haines, Hutch",null,846.3,414.9,1220.7,2481.9]
["Estes, Robbie",null,94.5,2780,128,"M4",4.5,55,1200,null,"Estes, Robbie",null,695.9,766.6,1008.6,2471.1]
["Cirilli, Bill",null,94,2400,130,"M4",4,55,1200,null,"Cirilli, Bill",null,678.8,711.5,1031.9000000000001,2422.1999999999998]
["Webb, Greg",null,87.5,1560,144,"M4",3.5,55,1300,null,"Webb, Greg",null,487.2,571.6,1196.8,2255.6]
["Anderson, Eric",null,91.5,1070,142,"M4",1.5,55,1200,null,"Anderson, Eric",null,598.6,472,1173,2243.6]
["Tipich, John",null,93,890,138,"M4",3,55,1200,null,"Tipich, John",null,645.70000000000005,429.8,1125.7,2201.1999999999998]
["Grisham, Thomas",null,87,2850,117,"M4",3,55,1300,null,"Grisham, Thomas",null,474.6,776.4,882.3,2133.3000000000002]
["Miller, Stephen",null,98,2600,131,"M5",2,55,1125,null,"Miller, Stephen",null,888.3,783.5,1236.0999999999999,2907.9]
["Smith, Jeffrey",null,88,3110,120,"M5",4,55,1300,null,"Smith, Jeffrey",null,540.4,915.4,1099.5999999999999,2555.4]
["Norton, Joel",null,86.5,2440,128,"M5",2.5,55,1300,null,"Norton, Joel",null,500,741.4,1198.7,2440.1]
["Wallace, Ham",null,96.5,740,126,"M5",0.5,55,1125,null,"Wallace, Ham",null,826.5,262.89999999999998,1173.9000000000001,2263.3000000000002]
["Laderer, Edward",null,97,2830,76,"M5",1,55,1125,null,"Laderer, Edward",null,846.7,843.3,569.70000000000005,2259.6999999999998]
["Zimlich, Carey",null,86,2110,118,"M5",2,55,1300,null,"Zimlich, Carey",null,487.1,653.4,1075,2215.5]
["Holm, Brian",null,93,1080,121,"M5",3,55,1200,null,"Holm, Brian",null,696.2,365.1,1112,2173.3000000000002]
["Archambeau, Robert",null,92,860,115,"M5",2,55,1200,null,"Archambeau, Robert",null,662.3,299.60000000000002,1038.0999999999999,2000]
["Johnson, Dee",null,85.5,1440,114,"M5",1.5,55,1300,null,"Johnson, Dee",null,474.5,468.8,1025.8,1969.1]
["Vandyk, Daniel",null,91,710,61,"M5",1,55,1200,null,"Vandyk, Daniel",null,629.79999999999995,253.6,396.9,1280.3]
["Bass, Sarvis",null,88,1550,65,"M6",4,55,1300,null,"Bass, Sarvis",null,820.1,595.1,640.9,2056.1]
["Hayes, Michael",null,87.25,780,43,"M6",3.25,55,1300,null,"Hayes, Michael",null,795.4,301.3,307.89999999999998,1404.6]
["Scharpf, Tad",null,3,1100,61,"M6",3,25,2300,null,"Scharpf, Tad",null,24,423.6,577.6,1025.2]
["Bucher, Don",null,79.5,780,0,"M6",1.5,55,1425,null,"Bucher, Don",null,572,301.3,0,873.3]
["Cooper, William",null,4.5,1010,0,"M6",4.5,25,2300,null,"Cooper, William",null,36,389.3,0,425.3]
["Burkhead, Joe",null,0,890,0,"M6",0,25,2300,null,"Burkhead, Joe",null,0,343.4,0,343.4]
["Longo, Dennis",null,87,1680,75,"M7",3,52,1200,null,"Longo, Dennis",null,848.4,730.5,897.8,2476.6999999999998]
["Reid, Glen",null,57.5,1160,45,"M7",3.5,52,2300,null,"Reid, Glen",null,93.7,524.20000000000005,421.7,1039.5999999999999]
["Nichols, Edson",null,58,470,39,"M7",4,52,2300,null,"Nichols, Edson",null,96.6,233.3,328.6,658.5]
["Svoboda, Ron",null,1,200,0,"M7",1,25,2300,null,"Svoboda, Ron",null,8,108.5,0,116.5]
["Piercy, Carrol",null,74.5,1830,51,"M8",2.5,49,1300,null,"Piercy, Carrol",null,700,1089.0999999999999,669.6,2458.6999999999998]
["Hosner, Jerry",null,80,1010,34,"M8",2,49,1200,null,"Hosner, Jerry",null,962.2,567.4,351.4,1881]
["Kunde, Bruce",null,69.5,1440,0,"M8",3.5,49,1425,null,"Kunde, Bruce",null,515.9,837.3,0,1353.2]
["Holmes, Chuck",null,4.5,700,43,"M8",4.5,25,2300,null,"Holmes, Chuck",null,36,379.5,518.79999999999995,934.3]
["Bryant, Errol",null,70,210,null,"M8",4,49,1425,null,"Bryant, Errol",null,532.20000000000005,101.3,0,633.5]
["Wahl, Roger",null,2,450,null,"M9",2,25,2300,null,"Wahl, Roger",null,16,293.2,0,309.2]
["Faulkner, Elgin",null,3,null,43,"MA",3,25,2300,null,"Faulkner, Elgin",null,24,0,1301.4000000000001,1325.4]
["Price, Harry",null,38,480,26,"MA",2,43,2300,null,"Price, Harry",null,455.6,480.8,244,1180.4000000000001]
["Horton, John",null,1,180,29,"MA",1,25,2300,null,"Horton, John",null,8,190.3,357.9,556.20000000000005]
["Schouten, Bill",null,2,300,null,"MA",2,25,2300,null,"Schouten, Bill",null,16,308.39999999999998,0,324.39999999999998]
["Phelps, Ronald",null,2.5,160,null,"MA",2.5,25,2300,null,"Phelps, Ronald",null,20,170.3,0,190.3]
["Lorenz, Tyler",null,102.5,4980,183,"OM",0.5,58,1125,null,"Lorenz, Tyler",null,913.6,999.1,1067.3,2980]
["Selsor, Storm",null,96.5,5900,176,"OM",0.5,58,1200,null,"Selsor, Storm",null,767.6,1080,1019.3,2866.9]
["Surdej, Jeff",null,92.5,3900,156,"OM",2.5,58,1300,null,"Surdej, Jeff",null,679.8,893.1,881.3,2454.1999999999998]
["Malak, Kevin",null,87.5,1770,150,"OM",3.5,58,1425,null,"Malak, Kevin",null,580.29999999999995,621.5,839.6,2041.4]
["Todd-strickl, Joy",null,92,6900,140,"OW",2,55,1200,null,"Todd-strickl, Joy",null,1007.1,1294.5999999999999,1162.8,3464.5]
["Lauretano, Alex",null,88,8680,127,"OW",4,55,1300,null,"Lauretano, Alex",null,907.6,1493.6,1039.2,3440.4]
["Morgan, Lauren",null,86,4270,150,"OW",2,55,1300,null,"Morgan, Lauren",null,860.2,960,1257.2,3077.4]
["Mcclure, Keri",null,99,3530,123,"W1",3,55,1125,null,"Mcclure, Keri",null,1245.5,997.4,1221.5999999999999,3464.5]
["Lindy, Alison",null,92,3700,116,"W1",2,55,1200,null,"Lindy, Alison",null,1081.0999999999999,1019.4,1157.7,3258.2]
["Rogers, Krista",null,86.5,2090,137,"W1",2.5,55,1300,null,"Rogers, Krista",null,960,781.7,1345.9,3087.6]
["Mcclure, Kayla",null,88,2570,116,"W1",4,55,1300,null,"Mcclure, Kayla",null,992.3,860.5,1157.7,3010.5]
["Seal, Monica",null,82,2270,125,"W1",4,55,1425,null,"Seal, Monica",null,866.2,812.3,1239.5999999999999,2918.1]
["Backlund, Caley",null,75.5,870,112,"W1",3.5,55,1600,null,"Backlund, Caley",null,739.1,520,1120.5999999999999,2379.6999999999998]
["Madden, Christine",null,63,2850,83,"W1",3,55,2300,null,"Madden, Christine",null,523.4,902.9,836.9,2263.1999999999998]
["Weis, Traci",null,81.5,860,76,"W1",3.5,55,1425,null,"Weis, Traci",null,856,517.20000000000005,763.3,2136.5]
["Timmerman, Leah",null,55.5,820,118,"W1",1.5,52,2300,null,"Timmerman, Leah",null,412.3,505.9,1176.0999999999999,2094.3000000000002]
["Tyler, Camille",null,55.5,1800,61,"W1",1.5,52,2300,null,"Tyler, Camille",null,412.3,729.2,596.29999999999995,1737.8]
["Zoellner, Kelly",null,94,3120,130,"W2",4,55,1200,null,"Zoellner, Kelly",null,1059.2,789.6,1166.9000000000001,3015.7]
["Kalkbrenner, Erin",null,92,2820,115,"W2",2,55,1200,null,"Kalkbrenner, Erin",null,1007.1,741.4,991,2739.5]
["Harris, Betsy",null,86,3750,109,"W2",2,55,1300,null,"Harris, Betsy",null,860.2,885.4,921.2,2666.8]
["Barringer, Jamie",null,80,3790,109,"W2",2,55,1425,null,"Barringer, Jamie",null,726.9,891.3,921.2,2539.4]
["Lemley, Sara",null,80,3930,98,"W2",2,55,1425,null,"Lemley, Sara",null,726.9,911.7,794.3,2432.9]
["Bucher, Michelle",null,87.5,1110,81,"W2",3.5,55,1300,null,"Bucher, Michelle",null,895.6,414.7,600.9,1911.2]
["Klein, Lisa",null,77,1060,56,"W2",5,55,1600,null,"Klein, Lisa",null,665.3,403,324.7,1393]
["Scharpf, Amy",null,0.5,990,106,"W2",0.5,25,2300,null,"Scharpf, Amy",null,4,386.2,886.5,1276.7]
["Petit, Kyle",null,74,850,45,"W2",2,55,1600,null,"Petit, Kyle",null,607,351.2,207.6,1165.8]
["Krueger, Lori",null,89,3880,103,"W3",5,55,1300,null,"Krueger, Lori",null,930.5,1103.0999999999999,964.8,2998.4]
["Nagle, Brandy",null,86,4210,100,"W3",2,55,1300,null,"Nagle, Brandy",null,843.3,1161.0999999999999,932.9,2937.3]
["Lamb, Lisa",null,80.5,1480,107,"W3",2.5,55,1425,null,"Lamb, Lisa",null,698.3,602.20000000000005,1007.2,2307.6999999999998]
["Krueger, Julie",null,81,3190,69,"W3",3,55,1425,null,"Krueger, Julie",null,710.7,975.4,592,2278.1]
["Friese, Heather",null,80.5,2000,79,"W3",2.5,55,1425,null,"Friese, Heather",null,698.3,727.5,704.3,2130.1]
["Withrow, Jenny",null,3.5,660,108,"W3",3.5,25,2300,null,"Withrow, Jenny",null,28,362.6,1017.8,1408.4]
["Bergmark, Connie",null,86,2330,91,"W4",2,55,1300,null,"Bergmark, Connie",null,938.5,802.7,1050.0999999999999,2791.3]
["Koenig, Mary",null,86.5,2330,89,"W4",2.5,55,1300,null,"Koenig, Mary",null,955,802.7,1021.1,2778.8]
["Abbott, Beverly",null,76.25,1890,66,"W4",4.25,55,1600,null,"Abbott, Beverly",null,656.1,691.4,687.8,2035.3]
["Olson, Diana",null,49,1790,81,"W4",1,49,2300,null,"Olson, Diana",null,192,665.1,905.1,1762.2]
["McCollum, Shelley",null,74,500,46,"W4",2,55,1600,null,"McCollum, Shelley",null,600.70000000000005,267.89999999999998,398.6,1267.2]
["Lindsey, Tristina",null,4,1650,41,"W4",4,25,2300,null,"Lindsey, Tristina",null,32,627.6,326.39999999999998,986]
["Gradick, Debra",null,61.5,740,0,"W4",1.5,55,2300,null,"Gradick, Debra",null,352.5,354.3,0,706.8]
["Fausold, Janie",null,86,2780,79,"W5",2,52,1200,null,"Fausold, Janie",null,1122.0999999999999,886.1,1019.3,3027.5]
["Tucker, Diane",null,74.5,2750,70,"W5",2.5,52,1425,null,"Tucker, Diane",null,610.4,877.6,866.8,2354.8000000000002]
["Madden, Janet",null,59,1670,56,"W5",5,52,2300,null,"Madden, Janet",null,241,566.1,632.29999999999995,1439.4]
["Surdej, Barb",null,69.5,1320,45,"W5",3.5,52,1600,null,"Surdej, Barb",null,458,460.4,450.9,1369.3]
["Schmitt, Cheryl",null,4,620,41,"W5",4,25,2300,null,"Schmitt, Cheryl",null,32,236.9,385.7,654.6]
["Edwards, Prissy",null,69,2630,52,"W6",3,52,1600,null,"Edwards, Prissy",null,688.6,1086.0999999999999,452.4,2227.1]
["Cavenaugh, Brenda",null,53,740,41,"W6",5,49,2300,null,"Cavenaugh, Brenda",null,234.3,351.3,233.8,819.4]
["Prociw, Janice",null,48.5,1300,59,"W7",0.5,49,2300,null,"Prociw, Janice",null,234.2,680.7,1109.9000000000001,2024.8]
["Piercy, Janet",null,69.5,1520,28,"W7",3.5,49,1425,null,"Piercy, Janet",null,871.8,776.2,216.7,1864.7]
["Fischer, Pat",null,52,1170,null,"W8",4,49,2300,null,"Fischer, Pat",null,414,807.7,0,1221.7]
["Price, Artis",null,37,1220,null,"WA",1,43,2300,null,"Price, Artis",null,389.8,1500,0,1889.8]